{"text_format":"1","workbook":"xlsx","n_sheets":13,"sheets":["使い方","入力用シート","計算方法","←ここまで","条件1","※1","※2","※2 (一時計算用_不使用)","※3","※4","AG-002（モニタリング）","AG-002 （計算方法）","方法論・認証実績一覧表"],"not_rendered":{"charts":0,"images":3,"macros":1,"external_links":0,"defined_names":26,"comments":0,"pivot_tables":0},"unopened":[],"bounds":{"document_bytes":16777216,"sheet_cells":100000,"rows_first":2000,"rows_last":500,"rows_between":2000,"halvings":0,"cell_chars":16384,"cell_head_chars":4096},"cells_cut":0,"cells_raw":0,"read":"whole","date_system":"1900"}

{"sheet":"使い方","index":0,"n_rows":26,"n_cols":3,"rows_kept":26,"cut":false,"hidden":false,"merged":[]}
[null,"【　シミュレーターの使い方　】"]
[null,"【AG-002:家畜排せつ物管理方法の変更】"]
[]
[null,"■入力用シート","☜クリックするとページにジャンプします。"]
[null,"モニタリング項目を入力することで、排出削減量が確認できます。"]
[]
[]
[]
[]
[]
[]
[]
[]
[]
[]
[]
[]
[]
[]
[]
{"$rows_left_out":7}
{"sheet":"入力用シート","index":1,"n_rows":113,"n_cols":9,"rows_kept":113,"cut":false,"hidden":false,"merged":[[9,1,9,2],[59,1,59,2],[104,1,104,2],[109,1,109,2],[10,2,10,3],[15,2,15,3],[29,2,29,3],[30,2,30,3],[33,2,33,3],[34,2,34,3],[48,2,48,3],[49,2,49,3],[89,2,89,3],[71,2,71,4],[67,2,67,4],[98,2,98,3],[53,2,53,3],[56,2,56,3],[64,2,64,4],[60,2,60,4],[111,2,111,3],[110,2,110,3],[93,2,93,3],[94,2,94,3],[99,2,99,3]]}
[]
[null,null,"　　【AG-002:家畜排せつ物管理方法の変更】"]
[null,null,"【黄色セルを上から順に、リストから選択または数値をご記入ください。】"]
[null,null,null,null,null,null,"自動入力"]
[null,null,null,null,null,null,"プロジェクト実施者が入力"]
[]
[null,null,"排出削減量(t-CO2)",null,{"$f":"計算方法!$F$10","v":58},"☜下記の黄色セルを入力することで、\n最終的に排出削減量が計算されます。"]
[]
[null,null,"1) 活動量のモニタリング"]
[null,"モニタリング項目",null,null,"数値","単位","備考"]
[null,"n","■　プロジェクト実施後の排せつ物の管理区分",null,"ふん尿分離","ー","選択肢から選択してください。"]
[null,null,null,"　ー ふん",null,null,{"$f":"IF($E$11=\"ふん尿分離\",\"選択肢から選択してください。\",\"\")","v":"選択肢から選択してください。"}]
[null,null,null,"　ー 尿",null,null,{"$f":"IF($E$11=\"ふん尿分離\",\"選択肢から選択してください。\",\"\")","v":"選択肢から選択してください。"}]
[null,null,null,"　ー ふん尿混合",null,null,{"$f":"IF($E$11=\"ふん尿混合\",\"選択肢から選択してください。\",\"\")","v":""}]
[null,"k","家畜の種類",null,"乳用牛","ー","選択肢から選択してください。"]
[null,"NPJ,n,k","■　プロジェクト実施後の管理区分 n において飼養した家畜種 k の平均飼養頭数",null,{"$f":"SUM(E17:E29)","v":36},{"$f":"IF(D16=\"　ー \",\"\",\"頭\")","v":""}]
[null,null,null,{"$f":"IFERROR(INDEX(※2!$B$4:$B$27, SMALL(IF(※2!$A$4:$A$27=$E$15, ROW(※2!$A$4:$A$27)-ROW(※2!$A$4)+1), ROW(1:1))),\"　ー \")","v":"　ー 搾乳牛(三産以上)"},1,"頭",{"$f":"IF(D17=\"　ー \",\"\",\"数値を入力してください。\")","v":"数値を入力してください。"}]
[null,null,null,{"$f":"IFERROR(INDEX(※2!$B$4:$B$27, SMALL(IF(※2!$A$4:$A$27=$E$15, ROW(※2!$A$4:$A$27)-ROW(※2!$A$4)+1), ROW(2:2))),\"　ー \")","v":"　ー 搾乳牛(二産)"},2,"頭",{"$f":"IF(D18=\"　ー \",\"\",\"数値を入力してください。\")","v":"数値を入力してください。"}]
[null,null,null,{"$f":"IFERROR(INDEX(※2!$B$4:$B$27, SMALL(IF(※2!$A$4:$A$27=$E$15, ROW(※2!$A$4:$A$27)-ROW(※2!$A$4)+1), ROW(3:3))),\"　ー \")","v":"　ー 搾乳牛(初産)"},3,"頭","数値を入力してください。"]
[null,null,null,{"$f":"IFERROR(INDEX(※2!$B$4:$B$27, SMALL(IF(※2!$A$4:$A$27=$E$15, ROW(※2!$A$4:$A$27)-ROW(※2!$A$4)+1), ROW(4:4))),\"　ー \")","v":"　ー 乾乳牛・未経産牛"},4,"頭","数値を入力してください。"]
{"$rows_left_out":94}
{"sheet":"計算方法","index":2,"n_rows":279,"n_cols":8,"rows_kept":279,"cut":false,"hidden":false,"merged":[[260,3,260,4],[259,3,259,4],[258,3,258,4],[265,3,265,4],[2,5,2,6],[245,3,245,4],[246,3,246,4],[215,3,215,5],[222,3,222,4],[73,3,73,4],[77,3,77,4],[82,3,82,5],[195,3,195,5],[190,3,190,4],[199,3,199,4],[156,3,156,4],[170,3,170,4],[214,3,214,4],[140,3,140,4],[226,3,226,5],[27,3,27,4],[31,3,31,4],[32,3,32,4],[139,3,139,4],[101,3,101,4],[102,3,102,4],[86,3,86,4],[65,3,65,4],[37,3,37,4],[33,3,33,5],[66,3,66,6]]}
[null,null,"計算方法：家畜排せつ物管理方法の変更",null,"【自動で計算されます。】"]
[]
[null,null,null,null,null,"自動入力"]
[]
[null,null,"１．適用条件"]
[null,null,"計算式記載なし"]
[]
[null,null,"２．排出削減量の算定"]
[null,null,"記号","定義",null,"数値","単位","計算式"]
[null,null,"ER","排出削減量",null,{"$f":"ROUNDDOWN($F$11-$F$12,0)","v":58},"tCO2e /年","ER = EMBL − EMPJ"]
[null,null,"EMBL","ベースライン排出量",null,{"$f":"ROUND(F175,1)","v":105.3},"tCO2e /年","ー"]
[null,null,"EMPJ","プロジェクト実施後排出量",null,{"$f":"ROUND($F$16,0)","v":47},"tCO2e /年","ー"]
[]
[null,null,"３．プロジェクト実施後排出量の算定"]
[null,null,"記号","定義",null,"数値","単位","計算式"]
[null,null,"EMPJ","プロジェクト実施後排出量",null,{"$f":"$F$17+$F$18","v":46.960866361428586},"tCO2e/年","EMPJ = EMPJ,M + EMPJ,S"]
[null,null,"EMPJ,M","プロジェクト実施後の主要排出量",null,{"$f":"F22","v":46.878197361428583},"tCO2e/年","ー"]
[null,null,"EMPJ,S","プロジェクト実施後の付随的な排出量 ",null,{"$f":"F108","v":8.2669000000000006E-2},"tCO2/年","ー"]
[]
[null,null,"＜主要排出活動＞"]
{"$rows_left_out":260}
{"sheet":"←ここまで","index":3,"n_rows":0,"n_cols":0,"rows_kept":0,"cut":false,"hidden":true,"merged":[]}

{"sheet":"条件1","index":4,"n_rows":28,"n_cols":8,"rows_kept":28,"cut":false,"hidden":true,"merged":[]}
[null,null,"我が国の排せつ物管理区分","CH4排出係数※1"]
["分離状況",null,"管理区分","乳用牛","肉用牛","豚","採卵鶏","ブロイラー"]
["ふん尿分離","ふん","貯留",2.35E-2,1.6E-2,4.9000000000000002E-2,1.2999999999999999E-3,2.0000000000000001E-4]
["ふん尿分離","ふん","天日乾燥",2E-3,2E-3,2E-3,1.4E-3,1.4E-3]
["ふん尿分離","ふん","火力乾燥",0,0,0,0,0]
["ふん尿分離","ふん","強制発酵",5.1999999999999995E-4,5.4000000000000001E-4,8.0000000000000004E-4,8.0000000000000004E-4,8.0000000000000004E-4]
["ふん尿分離","ふん","堆積発酵",3.7999999999999999E-2,1.2999999999999999E-3,1.6000000000000001E-3,1.2999999999999999E-3,2.0000000000000001E-4]
["ふん尿分離","ふん","焼却",4.0000000000000001E-3,4.0000000000000001E-3,4.0000000000000001E-3,4.0000000000000001E-3,4.0000000000000001E-3]
["ふん尿分離","ふん","メタン発酵",3.7999999999999999E-2,1.2999999999999999E-3,1.6000000000000001E-3,1.2999999999999999E-3,2.0000000000000001E-4]
["ふん尿分離","ふん","産業廃棄物処理",2.35E-2,1.6E-2,4.9000000000000002E-2,1.2999999999999999E-3,2.0000000000000001E-4]
["ふん尿分離","ふん","放牧",7.6000000000000004E-4,7.6000000000000004E-4,null,1.4E-3,1.4E-3]
["ふん尿分離","ふん","その他",3.7999999999999999E-2,4.0000000000000001E-3,4.0000000000000001E-3,4.0000000000000001E-3,4.0000000000000001E-3]
["ふん尿分離","尿","貯留",2.35E-2,1.6E-2,4.9000000000000002E-2,1.2999999999999999E-3,2.0000000000000001E-4]
["ふん尿分離","尿","強制発酵",5.1999999999999995E-4,5.4000000000000001E-4,9.7000000000000005E-4]
["ふん尿分離","尿","浄化",3.0000000000000001E-3,3.0000000000000001E-3,9.1000000000000004E-3]
["ふん尿分離","尿","メタン発酵",3.7999999999999999E-2,1.2999999999999999E-3,1.6000000000000001E-3,1.2999999999999999E-3,2.0000000000000001E-4]
["ふん尿分離","尿","産業廃棄物処理",2.35E-2,1.6E-2,4.9000000000000002E-2,1.2999999999999999E-3,2.0000000000000001E-4]
["ふん尿分離","尿","その他",{"$f":"AVERAGE(D13:D17)","v":1.7703999999999998E-2},{"$f":"AVERAGE(E13:E17)","v":7.3679999999999995E-3},2.1933999999999999E-2,1.2999999999999999E-3,2.0000000000000001E-4]
["ふん尿混合",null,"貯留",2.35E-2,1.6E-2,4.9000000000000002E-2,1.2999999999999999E-3,2.0000000000000001E-4]
["ふん尿混合",null,"天日乾燥",2E-3,2E-3,2E-3,1.4E-3,1.4E-3]
{"$rows_left_out":9}
{"sheet":"※1","index":5,"n_rows":17,"n_cols":6,"rows_kept":17,"cut":false,"hidden":true,"merged":[]}
["牛、豚、採卵鶏、ブロイラーの排せつ物管理に伴う CH4 排出係数（g-CH4/g 有機物）"]
["処理区分","乳用牛","肉用牛","豚","採卵鶏","ブロイラー"]
["貯留",2.35E-2,1.6E-2,4.9000000000000002E-2,1.2999999999999999E-3,2.0000000000000001E-4]
["天日乾燥",2E-3,2E-3,2E-3,1.4E-3,1.4E-3]
["火力乾燥",0,0,0,0,0]
["強制発酵（ふん）",5.1999999999999995E-4,5.4000000000000001E-4,8.0000000000000004E-4,8.0000000000000004E-4,8.0000000000000004E-4]
["堆積発酵",3.7999999999999999E-2,1.2999999999999999E-3,1.6000000000000001E-3,1.2999999999999999E-3,2.0000000000000001E-4]
["焼却",4.0000000000000001E-3,4.0000000000000001E-3,4.0000000000000001E-3,4.0000000000000001E-3,4.0000000000000001E-3]
["強制発酵（尿）",5.1999999999999995E-4,5.4000000000000001E-4,9.7000000000000005E-4]
["強制発酵（ふん尿混合）",5.1999999999999995E-4,5.4000000000000001E-4,8.0000000000000004E-4]
["浄化",3.0000000000000001E-3,3.0000000000000001E-3,9.1000000000000004E-3]
["メタン発酵（ふん）",3.7999999999999999E-2,1.2999999999999999E-3,1.6000000000000001E-3,1.2999999999999999E-3,2.0000000000000001E-4]
["メタン発酵（ふん尿混合）",3.0200000000000001E-2,3.5000000000000003E-2,3.5999999999999997E-2]
["産業廃棄物処理",2.35E-2,1.6E-2,4.9000000000000002E-2,1.2999999999999999E-3,2.0000000000000001E-4]
["放牧",7.6000000000000004E-4,7.6000000000000004E-4,null,1.4E-3,1.4E-3]
["その他（ふん）",3.7999999999999999E-2,4.0000000000000001E-3,4.0000000000000001E-3,4.0000000000000001E-3,4.0000000000000001E-3]
["その他（ふん尿混合）",3.7999999999999999E-2,3.5000000000000003E-2,4.9000000000000002E-2]

{"sheet":"※2","index":6,"n_rows":27,"n_cols":6,"rows_kept":27,"cut":false,"hidden":true,"merged":[]}
["家畜種ごとの排せつ物排せつ量及び排せつ物中窒素量(2019)"]
["家畜種",null,"排せつ物量 [kg/頭/日]",null," 排せつ物中窒素量 [g-N/頭/日] "]
[null,null,"ふん","尿","ふん","尿"]
["乳用牛","　ー 搾乳牛(三産以上)",48.2,16.899999999999999,194.7,96.4]
["乳用牛","　ー 搾乳牛(二産)",46.7,17.100000000000001,185.5,104.5]
["乳用牛","　ー 搾乳牛(初産)",42.9,18.7,163.6,101]
["乳用牛","　ー 乾乳牛・未経産牛",28.4,15.3,85.2,101.4]
["乳用牛","　ー 育成牛(7-24カ月)",23.2,12.5,58.5,71.099999999999994]
["乳用牛","　ー 育成牛(3-6カ月)",15.9,5.0999999999999996,24.9,44.2]
["肉用牛","　ー 繁殖雌牛(2歳以上)",18.2,7.4,61.8,74.900000000000006]
["肉用牛","　ー 繁殖雌牛(7カ月～2歳未満)",14.2,6.8,56.2,70.599999999999994]
["肉用牛","　ー 繁殖雌牛(3カ月～6カ月)",5.7,3.4,24.3,54.3]
["肉用牛","　ー 肥育牛・雄(１歳以上)",10.8,7.1,59.1,71.900000000000006]
["肉用牛","　ー 肥育牛・雄(7カ月～１歳未満)",10.3,6.3,51.3,71.599999999999994]
["肉用牛","　ー 肥育牛・雄(3カ月～6カ月)",3.1,3,20.7,48.2]
["肉用牛","　ー 肥育牛・雌(１歳以上)",11.2,5.8,46.4,57.2]
["肉用牛","　ー 肥育牛・雌(7カ月～１歳未満)",8.1999999999999993,5.4,42.7,60.4]
["肉用牛","　ー 肥育牛・雌(3カ月～6カ月)",4.7,3.1,22,51.6]
["肉用牛","　ー 乳用種(7カ月以上)",14.6,7.8,61.3,85.5]
["肉用牛","　ー 乳用種(3カ月～6カ月)",8.1999999999999993,4,31.8,61.8]
{"$rows_left_out":8}
{"sheet":"※2 (一時計算用_不使用)","index":7,"n_rows":32,"n_cols":7,"rows_kept":32,"cut":false,"hidden":true,"merged":[]}
["家畜種ごとの排せつ物排せつ量及び排せつ物中窒素量(2019)"]
["家畜種",null,null,"排せつ物量 [kg/頭/日]",null," 排せつ物中窒素量 [g-N/頭/日] "]
[null,null,null,"ふん","尿","ふん","尿"]
["乳用牛","搾乳牛(三産以上)",{"$f":"入力用シート!E36:E41","v":100},48.2,16.899999999999999,194.7,96.4]
["乳用牛","搾乳牛(二産)",0,46.7,17.100000000000001,185.5,104.5]
["乳用牛","搾乳牛(初産)",0,42.9,18.7,163.6,101]
["乳用牛","乾乳牛・未経産牛",0,28.4,15.3,85.2,101.4]
["乳用牛","育成牛(7-24カ月)",0,23.2,12.5,58.5,71.099999999999994]
["乳用牛","育成牛(3-6カ月)",0,15.9,5.0999999999999996,24.9,44.2]
["乳用牛",null,"小計",{"$f":"SUM($C$4 * D4:D9)","v":20530},{"$f":"SUM($C$4 * E4:E9)","v":8560},{"$f":"SUM($C$4 * F4:F9)","v":71240},{"$f":"$C$4 * SUM(G4:G9)","v":51860}]
["肉用牛","繁殖雌牛(2歳以上)",{"$f":"入力用シート!E36:E48","v":100},18.2,7.4,61.8,74.900000000000006]
["肉用牛","繁殖雌牛(7カ月～2歳未満)",0,14.2,6.8,56.2,70.599999999999994]
["肉用牛","繁殖雌牛(3カ月～6カ月)",0,5.7,3.4,24.3,54.3]
["肉用牛","肥育牛・雄(１歳以上)",0,10.8,7.1,59.1,71.900000000000006]
["肉用牛","肥育牛・雄(7カ月～１歳未満)",0,10.3,6.3,51.3,71.599999999999994]
["肉用牛","肥育牛・雄(3カ月～6カ月)",0,3.1,3,20.7,48.2]
["肉用牛","肥育牛・雌(１歳以上)",0,11.2,5.8,46.4,57.2]
["肉用牛","肥育牛・雌(7カ月～１歳未満)",0,8.1999999999999993,5.4,42.7,60.4]
["肉用牛","肥育牛・雌(3カ月～6カ月)",0,4.7,3.1,22,51.6]
["肉用牛","乳用種(7カ月以上)",0,14.6,7.8,61.3,85.5]
{"$rows_left_out":13}
{"sheet":"※3","index":8,"n_rows":8,"n_cols":3,"rows_kept":8,"cut":false,"hidden":true,"merged":[]}
["家畜種ごとの排せつ物中の有機物含有率(湿ベース)"]
["家畜種","有機物含有率"]
[null,"ふん","尿"]
["乳用牛",0.16,5.0000000000000001E-3]
["肉用牛",0.18,0.02]
["豚",0.2,1.4E-3]
["採卵鶏",0.15]
["ブロイラー",0.15]

{"sheet":"※4","index":9,"n_rows":28,"n_cols":15,"rows_kept":28,"cut":false,"hidden":true,"merged":[]}
["牛、豚、採卵鶏、ブロイラーの排せつ物管理に伴うN2O排出係数（g-N2O/g 有機物）"]
["処理区分","乳用牛","肉用牛","豚","採卵鶏","ブロイラー",null,null,"処理区分",null,"乳用牛","肉用牛","豚","採卵鶏","ブロイラー"]
["貯留",2.0000000000000001E-4,0,0,5.4000000000000003E-3,8.0000000000000004E-4,null,null,"ふん","貯留",2.0000000000000001E-4,0,0,5.4000000000000003E-3,8.0000000000000004E-4]
["天日乾燥",0.02,0.02,0.02,3.3E-3,3.3E-3,null,null,"ふん","天日乾燥",0.02,0.02,0.02,3.3E-3,3.3E-3]
["火力乾燥",0.02,0.02,0.02,0.02,0.02,null,null,"ふん","火力乾燥",0.02,0.02,0.02,0.02,0.02]
["強制発酵（ふん）",2.5000000000000001E-3,2.5000000000000001E-3,1.6000000000000001E-3,1.6000000000000001E-3,1.6000000000000001E-3,null,null,"ふん","強制発酵",2.5000000000000001E-3,2.5000000000000001E-3,1.6000000000000001E-3,1.6000000000000001E-3,1.6000000000000001E-3]
["堆積発酵",2.4E-2,1.6E-2,2.5000000000000001E-2,5.4000000000000003E-3,8.0000000000000004E-4,null,null,"ふん","堆積発酵",2.4E-2,1.6E-2,2.5000000000000001E-2,5.4000000000000003E-3,8.0000000000000004E-4]
["焼却",1E-3,1E-3,1E-3,1E-3,1E-3,null,null,"ふん","焼却",1E-3,1E-3,1E-3,1E-3,1E-3]
["強制発酵（尿）",6.0000000000000001E-3,6.0000000000000001E-3,6.0000000000000001E-3,null,null,null,null,"ふん","メタン発酵",2.4E-2,1.6E-2,2.5000000000000001E-2,5.4000000000000003E-3,8.0000000000000004E-4]
["強制発酵（ふん尿混合）",6.0000000000000001E-3,2.5000000000000001E-3,1.6000000000000001E-3,null,null,null,null,"ふん","産業廃棄物処理",2.0000000000000001E-4,0,0,5.4000000000000003E-3,8.0000000000000004E-4]
["浄化",2.8799999999999999E-2,2.8799999999999999E-2,2.87E-2,null,null,null,null,"ふん","放牧",6.8399999999999997E-3,6.8399999999999997E-3,null,3.3E-3,3.3E-3]
["メタン発酵（ふん）",2.4E-2,1.6E-2,2.5000000000000001E-2,5.4000000000000003E-3,8.0000000000000004E-4,null,null,"ふん","その他",2.4E-2,0.02,2.5000000000000001E-2,0.02,0.02]
["メタン発酵（ふん尿混合）",1.5E-3,1.5E-3,1.5E-3,null,null,null,null,"尿","貯留",2.0000000000000001E-4,0,0,5.4000000000000003E-3,8.0000000000000004E-4]
["産業廃棄物処理",2.0000000000000001E-4,0,0,5.4000000000000003E-3,8.0000000000000004E-4,null,null,"尿","強制発酵",6.0000000000000001E-3,6.0000000000000001E-3,6.0000000000000001E-3]
["放牧",6.8399999999999997E-3,6.8399999999999997E-3,null,3.3E-3,3.3E-3,null,null,"尿","浄化",2.8799999999999999E-2,2.8799999999999999E-2,2.87E-2]
["その他（ふん）",2.4E-2,0.02,2.5000000000000001E-2,0.02,0.02,null,null,"尿","メタン発酵",2.4E-2,1.6E-2,2.5000000000000001E-2,5.4000000000000003E-3,8.0000000000000004E-4]
["その他（ふん尿混合）",2.8799999999999999E-2,2.8799999999999999E-2,2.87E-2,null,null,null,null,"尿","産業廃棄物処理",2.0000000000000001E-4,0,0,5.4000000000000003E-3,8.0000000000000004E-4]
[null,null,null,null,null,null,null,null,"尿","その他",{"$f":"AVERAGE(K13:K17)","v":1.184E-2},{"$f":"AVERAGE(L13:L17)","v":1.0159999999999999E-2},1.1940000000000001E-2,5.3999999999999994E-3,8.0000000000000004E-4]
[null,null,null,null,null,null,null,null,"ふん尿混合","貯留",2.0000000000000001E-4,0,0,5.4000000000000003E-3,8.0000000000000004E-4]
[null,null,null,null,null,null,null,null,"ふん尿混合","天日乾燥",0.02,0.02,0.02,3.3E-3,3.3E-3]
{"$rows_left_out":9}
{"sheet":"AG-002（モニタリング）","index":10,"n_rows":57,"n_cols":4,"rows_kept":57,"cut":false,"hidden":true,"merged":[[52,0,53,0],[52,1,53,1],[54,0,55,0],[54,1,55,1],[34,0,35,0],[34,1,35,1],[36,0,37,0],[36,1,37,1],[46,0,46,1],[51,0,51,1],[3,0,3,1],[19,0,19,1],[27,0,28,0],[27,1,28,1],[29,0,30,0],[29,1,30,1]]}
[]
["６．モニタリング方法"]
["1) 活動量のモニタリング"]
["モニタリング項目",null,"モニタリング方法例","モニタリング頻度"]
["n","プロジェクト実施後の排せつ物の管理区分","・日本国温室効果ガスインベントリ報告書記載の区分を利用\n・生産記録、写真","【要求頻度】\n検証申請時に最新のものを使用"]
["k","家畜の種類","・日本国温室効果ガスインベントリ報告書記載の区分を利用","【要求頻度】\n検証申請時に最新のものを使用"]
["NPJ,n,k","プロジェクト実施後の管理区分 n において飼養した家畜種 k の平均飼養頭数（頭）","・生産記録、出荷記録で計測","対象期間で累計"]
["DPJ,n,k","プロジェクト実施後の排せつ管理区分 n において家畜種 k を飼養した日数（日/年）","・日報、生産記録で計測","対象期間で累計"]
["FPJ,process","プロジェクト実施後の排せつ物管理設備における燃料使用量（kL/年、t/年、m3/年等）","・燃料供給会社からの請求書をもとに算定\n・重量計による計測","対象期間で累計"]
["ELPJ,process","プロジェクト実施後の排せつ物管理設備における電力使用量（kWh/年）","・電力会社からの請求書をもとに算定\n・電力計による計測","対象期間で累計"]
["FPJ,transport","プロジェクト実施後の排せつ物の運搬における燃料使用量（kL/年）","・燃料供給会社からの請求書をもとに算定\n・重量計による計測","対象期間で累計"]
["NBefore,m,k","プロジェクト実施前の排せつ管理区分 m において飼養した家畜種 k の平均飼養頭数（頭）","・生産記録、出荷記録で計測","対象期間で累計"]
["DBefore,m,k","プロジェクト実施前の排せつ管理区分 m において家畜種 k を飼養した日数（日/年）","・日報、生産記録で計測","対象期間で累計"]
["m","ベースラインの排せつ物の管理区分","・日本国温室効果ガスインベントリ報告書記載の区分を利用\n・生産記録、写真","【要求頻度】\n検証申請時に最新のものを使用"]
["FBL,process","ベースラインの排せつ物管理設備における燃料使用量（kL/年、t/年、m3/年等）","・燃料供給会社からの請求書をもとに算定\n・重量計による計測","対象期間で累計"]
["ELBL,process","ベースラインの排せつ物管理設備における電力使用量（kWh/年）","・電力会社からの請求書をもとに算定\n・電力計による計測","対象期間で累計"]
["FBL,transport","ベースラインの排せつ物の運搬における燃料使用量（kL/年）","・燃料供給会社からの請求書をもとに算定\n・重量計による計測","対象期間で累計"]
[]
["2) 係数のモニタリング"]
["モニタリング項目",null,"モニタリング方法例","モニタリング頻度"]
{"$rows_left_out":38}
{"sheet":"AG-002 （計算方法）","index":11,"n_rows":149,"n_cols":6,"rows_kept":149,"cut":false,"hidden":true,"merged":[]}
[]
["１．適用条件","計算式記載なし"]
[]
["２．排出削減量の算定"]
["記号","定義","数値","単位","計算式","備考"]
["ER","排出削減量",null,"tCO2e /年","ER = EMBL − EMPJ","ー"]
["EMBL","ベースライン排出量",null,"tCO2e /年","ー","ー"]
["EMPJ","プロジェクト実施後排出量",null,"tCO2e /年","ー","ー"]
[]
[]
["3．プロジェクト実施後排出量の算定"]
["記号","定義","数値","単位","計算式","備考"]
["EMPJ","プロジェクト実施後排出量",null,"tCO2e/年","EMPJ = EMPJ,M + EMPJ,S","ー"]
["EMPJ,M","プロジェクト実施後の主要排出量",null,"tCO2e/年","ー","ー"]
["EMPJ,S","プロジェクト実施後の付随的な排出量 ",null,"tCO2/年","ー","ー"]
[]
["＜主要排出活動＞"]
["記号","定義","数値","単位","計算式","備考"]
["EMPJ,M","プロジェクト実施後の主要排出量",null,"tCO2e/年","EMPJ,M = EMPJ,M ,CH4 + EMPJ,M ,N2O","ー"]
["EMPJ,M,CH4","プロジェクト実施後の CH4 起源排出量",null,"tCO2e/年","ー","ー"]
{"$rows_left_out":130}
{"sheet":"方法論・認証実績一覧表","index":12,"n_rows":22,"n_cols":15,"rows_kept":22,"cut":false,"hidden":true,"merged":[[16,6,20,6],[16,0,20,0],[16,1,20,1],[16,2,20,2],[16,3,20,3],[16,4,20,4],[16,5,20,5],[3,6,4,6],[3,7,3,10],[3,11,3,14],[10,0,15,0],[10,1,15,1],[10,2,15,2],[10,3,15,3],[10,4,15,4],[10,5,15,5],[10,6,15,6],[3,0,4,0],[3,1,4,1],[3,2,4,2],[3,3,4,3],[3,4,4,4],[3,5,4,5]]}
[]
["J-クレジットの農業分野の方法論及び認証実績一覧表"]
[]
["方法論No.","方法論","削減方法","適用条件","ベースライン排出量の考え方","主なモニタリング項目","適用条件","J-クレジット認証実績（通常型）",null,null,null,"J-クレジット認証実績（プログラム型）"]
[null,null,null,null,null,null,null,"認証申請日","プロジェクト実施者","プロジェクト概要","認証量","認証申請日","運営・管理者","プロジェクト概要","認証量"]
["AG-001","牛・豚・ブロイラーへのアミノ酸バランス改善飼料の給餌","慣用飼料に代えてアミノ酸バランス改善飼料を給餌することにより、排せつ物管理からのN2O排出量を抑制する。","① プロジェクト実施前において、慣用飼料給餌量が、牛・豚は「日本飼養標準」の1.2倍、ブロイラーは品種ごとに定められた「栄養推奨値」の1.1倍を上回らないこと。\n② プロジェクト実施後において、慣用飼料のCP含有率（％）から1～3％引き下げたCP含有率のアミノ酸バランス改善飼料を給餌し、牛・豚はその給餌量が「日本飼養標準」の1.2倍、ブロイラーは品種毎に定められた「栄養推奨値」の1.1倍を上回らないこと。\n③ 排せつ物の処理方法は「貯留、天日乾燥、火力乾燥、炭化処理、強制発酵、堆積発酵、焼却、浄化、メタン発酵、産業廃棄物処理、放牧又はその他」のいずれかであること。\n④ アミノ酸バランス改善飼料を給餌する家畜は乳用牛・肉用牛・肥育豚・ブロイラーであること。\n⑤ ブロイラーへの給餌について、プロジェクト実施後の1日１羽あたりのCPの給餌量が、プロジェクト前より増加しないこと。"," 乳用牛・肉用牛・肥育豚・ブロイラーをアミノ酸バランス改善飼料ではなく、慣用飼料で使用した場合に想定される温室効果ガス排出量","• 排せつ物の管理区分\n• 乳用牛・肉用牛・肥育豚の平均飼養頭数及び飼養日数、ブロイラーの平均飼養羽数及び飼養日数\n• 慣用飼料及びアミノ酸バランス改善飼料のCP含有率（％）、乾物摂取量、\n• ブロイラーへのプロジェクト実施前後の１日１羽当たりの給餌量（重量）","本方法論は、次の条件の全てを満たす場合に適用することができる。\n• 条件 1：プロジェクト実施前には慣用飼料を給餌しており、その給餌量が牛は「日本飼養標準」に基づく慣行レベル（標準 CP 値）に安全率 20％を見込んだ水準（標準 CP 値の 1.2 倍）を、豚は「日本飼養標準」に基づく慣行レベル（標準 CP 値）に安全率 20%を見込んだ水準（標準CP 値の 1.2 倍）を、ブロイラーはブロイラー品種ごとに定められた栄養推奨値の CP 値に安全率 10%を見込んだ水準（栄養推奨値の CP 値の 1.1 倍）を上回らないこと。\n• 条件 2：プロジェクト実施後には慣用飼料の CP 含有率（%）から 1～3%引き下げた CP 含有率のアミノ酸バランス改善飼料を給餌しており、その給餌量が牛は「日本飼養標準」に基づく慣行レベル（標準 CP 値）に安全率 20％を見込んだ水準（標準 CP 値の 1.2 倍）を、豚は「日本飼養標準」に基づく慣行レベル（標準 CP 値）に安全率 20%を見込んだ水準（標準 CP 値の 1.2 倍）を、ブロイラーはブロイラー品種ごとに定められた栄養推奨値の CP 値に安全率 10%を見込んだ水準（栄養推奨値の CP 値の 1.1 倍）を上回らないこと。\n• 条件 3：プロジェクト実施前後の排せつ物処理方法は温室効果ガスインベントリ報告書で記された「貯留、天日乾燥、火力乾燥、炭化処理、強制発酵、堆積発酵、焼却、浄化、メタン発酵、産業廃棄物処理、放牧又はその他」のいずれかであること。\n• 条件 4：アミノ酸バランス改善飼料を給餌する家畜は、乳用牛・肉用牛・肥育豚・ブロイラーであること。\n• 条件 5：ブロイラーへの給餌について、プロジェクト実施後の 1 日 1 羽当たりの CP の給餌量\n（重量）は、プロジェクト実施前より増加しないこと。","―","―","―","―","―","―","―","―"]
["AG-002","家畜排せつ物管理方法の変更","家畜の飼養における排せつ物の管理方法を変更することによりCH4及びN2O排出量を抑制する。","① 温室効果ガスの排出が少ない排せつ物管理方法へと変更すること及びプロジェクト実施前後の排せつ物管理方法が日本国温室効果ガスインベントリ報告書で規定される管理区分に該当すること。\n② プロジェクト実施前後で、家畜種を変更しないこと。\n③ 家畜は、日本国温室効果ガスインベントリ報告書で規定される牛（乳用牛又は肉用牛）、豚又は鶏（採卵鶏又はブロイラー）であること。","プロジェクト実施後の家畜排せつ物をプロジェクト実施前の管理方法で処理する場合に想定される温室効果ガス排出量。","・ プロジェクト実施前後の排せつ物管理区分\n・プロジェクト実施後の排せつ物管理区分ごとの家畜種ごとの飼養頭数及び飼養日数\n・ 排せつ物管理における燃料使用量及び電力使用量","本方法論は、次の条件の全てを満たす場合に適用することができる。\n• 条件 1：プロジェクト実施前の家畜排せつ物管理方法から、GHG 排出量が少ない家畜排せつ物管理方法へと変更すること。また、プロジェクト実施前後で、家畜排せつ物の管理方法が日本国温室効果ガスインベントリ報告書で規定される管理区分に該当すること。\n• 条件 2：プロジェクト実施前後で、家畜種を変更しないこと。\n• 条件 3：家畜は、日本国温室効果ガスインベントリ報告書で規定される牛（乳用牛又は肉用牛）、豚又は鶏（採卵鶏又はブロイラー）であること。","―","―","―","―","―","―","―","―"]
["AG-003","茶園土壌への硝化抑制剤入り化学肥料又は石灰窒素を含む複合肥料の施肥","茶の栽培において、茶園に硝化抑制剤入りの化学肥料又は石灰窒素を含む複合肥料を施肥し、プ ロジェクト実施前の肥料施肥量を減らすことで、土壌からのN2O排出量を削減する。","① プロジェクト実施前に施肥していた石灰窒素以外の窒素含有化学肥料又は有機肥料をジシアンジアミドが混合された化学肥料又は石灰窒素を含む複合肥料に代替すること。\n② 硝化抑制剤入り化学肥料又は石灰窒素を含む複合肥料を施肥する土壌で栽培する作物は茶であること。\n③ プロジェクト実施前後で、肥料の施肥方法、落葉・剪定枝の管理方法について変更がないこと。\n④ プロジェクト実施前に平均施肥量について1年間以上のデータがあること","茶園において、硝化抑制剤入り化学肥料又は石灰窒素を含む複合肥料ではない、窒素含有化学肥料又は有機肥料を施肥する場合に想定される温室効果ガス排出量。","・プロジェクト実施後に硝化抑制剤入り化学肥料又は石灰窒素を含む複合肥料を施肥する面積及び平均施肥量\n・プロジェクトで施肥した硝化抑制剤入り化学肥料中又は石灰窒素を含む複合肥料中の窒素量及びジシアンジアミド含有量\n・プロジェクト実施前に化学肥料を施肥していた面積及び平均施肥量","本方法論は、次の条件の全てを満たす場合に適用することができる。\n・条件 1：プロジェクト実施前に使用している石灰窒素以外の窒素含有化学肥料又は有機肥料を、プロジェクト実施後は硝化抑制剤であるジシアンジアミドが混合された化学肥料又は石灰窒素を含む複合肥料※に代替すること。\n・条件 2：硝化抑制剤入り化学肥料又は石灰窒素を含む複合肥料を施肥する土壌で栽培する作物は、茶であること。\n・条件 3：プロジェクト実施前後で、肥料の施肥方法、茶樹の落葉の管理方法、剪定枝の管理方法のいずれについても変更がないこと。\n・条件 4：窒素含有化学肥料又は有機肥料の平均施肥量について、プロジェクト実施前 1 年間以上のデータがあること。","―","―","―","―","―","―","―","―"]
["AG-004","バイオ炭の農地施用","ー","① バイオ炭を、農地法第2条に定める「農地」又は「採草放牧地」における鉱質の土壌に施用すること。\n② 施用するバイオ炭は、炭素含有率及び100年後の炭素残存率のデフォルト値が適用できる種類であること、又はそのようなデフォルト値が適用できる原料及び製炭温度により製造されたものであることが、客観的に確認できること。\n③ バイオ炭の原料は国産であり、塗料、接着剤等が含まれていないこと。また、他に利用用途のないものであること（燃料用炭の副生物等も対象）。","ー","ー","本方法論は、次の条件の全てを満たす場合に適用することができる。\n・ 条件 1：バイオ炭を、農地法第 2 条に定める「農地」又は「採草放牧地」における鉱質の土壌に施用すること。\n・ 条件 2：施用するバイオ炭は、炭素含有率及び 100 年後の炭素残存率のデフォルト値が適用できる種類であること、又はそのようなデフォルト値が適用できる原料及び製炭温度により製造されたものであることが、客観的に確認できること。\n・ 条件 3：バイオ炭の原料として木材（竹も含む）を使用する場合、当該原料は国内産であること。\n・ 条件 4：バイオ炭の原料は、未利用の生物資源であること。また、農地施用を用途とするバイオ炭の製造を目的として主伐された木材でないこと。\n・ 条件 5：バイオ炭の原料には、異物、塗料、接着剤、防腐剤、薬剤、有害物が含まれてないこと。また、その入手・使用にあたって法令違反や不適切な手続がないこと。","―","―","―","―","2022-03-29","一般社団法人　日本クルベジ協会","農家におけるバイオ炭の農地利用",247]
["AG-005","水稲栽培における中干し期間の延長","ー","ー","ー","ー","本方法論は、次の条件を満たす場合に適用することができる。\n・ 条件：水稲栽培において、中干しの期間を、プロジェクト実施水田（以下、「当該水田」という。）におけるプロジェクト実施前の直近 2 か年以上の実施日数の平均より 7 日間以上延長すること。","―","―","―","―","―","―","―","―"]
["EN-S-002","ヒートポンプの導入","効率のよいヒートポンプを導入することにより、化石燃料の使用量を削減する。","① 更新前の熱源設備又は標準的な熱源設備よりも効率のよいヒートポンプを導入すること。\n② ヒートポンプで生産した温水、冷水又は蒸気の熱を全部又は一部を自家消費すること。","プロジェクト実施後のヒートポンプによる生成熱量を、ベースラインの熱源設備から得る場合に想定されるCO2排出量。","・ プロジェクト実施後のヒートポンプにおけるエネルギー使用量\n・プロジェクト実施後のヒートポンプの効率\n・ 更新前の熱源設備又は標準的な熱源設備の効率","本方法論は、次の条件の全てを満たす場合に適用することができる。\n• 条件 1：プロジェクト登録基準を満たすヒートポンプを導入すること。\n• 条件 2：ベースラインの設備を特定できること。\n• 条件 3：ヒートポンプで生産した温水、冷水又は蒸気の熱の全部又は一部を自家消費すること。","2017-02-27","社会福祉法人　敬長福祉会","特別養護老人ホームにおけるヒートポンプの導入",81,"2015-11-18","北海道東急ビルマネジメント株式会社","マンションにおけるヒートポンプの新設",71]
[null,null,null,null,null,null,null,"2016-11-24","株式会社 西村屋","ホテルにおける吸収式冷温水機の更新 (A重油→都市ガス)",127,"2016-11-24","北海道東急ビルマネジメント株式会社","マンションにおけるヒートポンプの新設",84]
[null,null,null,null,null,null,null,"2020-05-29","株式会社 西村屋","ホテルにおける吸収式冷温水機の更新 (A重油→都市ガス)",521,"2018-11-22","北海道東急ビルマネジメント株式会社","マンションにおけるヒートポンプの新設",190]
[null,null,null,null,null,null,null,"2022-03-30","留寿都村","公共施設におけるヒートポンプの新設 (電気)",72,"―","―","―","―"]
[null,null,null,null,null,null,null,"2020-02-10","国立大学法人岐阜大学","病院におけるヒートポンプの更新",2093,"―","―","―","―"]
[null,null,null,null,null,null,null,"2021-03-29","株式会社萬世閣","温泉施設におけるヒートポンプの導入",412,"―","―","―","―"]
["EN-S-004","空調設備の導入","効率のよい空調設備を導入することにより、電力等の使用量を削減する。","① 更新前の空調設備又は標準的な空調設備よりも、効率のよい空調設備を導入すること。\n② 空調設備で生産した暖気又は冷気の全部又は一部を自家消費すること。","プロジェクト実施後の空調設備による生成熱量を、ベースラインの空調設備から得る場合に想定されるCO2排出量。","・プロジェクト実施後の空調設備におけるエネルギー使用量\n・ プロジェクト実施後の空調設備のエネルギー消費効率\n・ 更新前の空調設備又は標準的な空調設備のエネルギー消費効率","本方法論は、次の条件の全てを満たす場合に適用することができる。\n• 条件 1：プロジェクト登録基準を満たす空調設備を導入すること。\n• 条件 2：ベースラインの設備を特定できること。\n• 条件 3：空調設備で生産した暖気又は冷気の全部又は一部を自家消費すること。","2016-03-01","株式会社グリーンヘリテージ","ゴルフ場における空調設備の更新",8,"2015-11-18","北海道東急ビルマネジメント株式会社","マンションにおける空調設備の新設",21]
[null,null,null,null,null,null,null,"2018-03-06","株式会社グリーンヘリテージ","ゴルフ場における空調設備の更新",8,"2018-11-22","北海道東急ビルマネジメント株式会社","マンションにおける空調設備の新設",220]
[null,null,null,null,null,null,null,"2017-02-27","社会福祉法人　敬長福祉会","特別養護老人ホームにおける空調設備の更新 (灯油、電力→電力)",17,"2015-11-17","環境経済株式会社","事業所における空調設備の更新 (電気→電気)",13]
[null,null,null,null,null,null,null,"2018-02-23","株式会社欽山","温泉施設における空調設備の更新 (灯油→都市ガス)",0,"―","―","―","―"]
{"$rows_left_out":2}