{"text_format":"1","workbook":"xlsx","n_sheets":7,"sheets":["使い方","入力用シート","計算方法","バイオ炭の種類","燃料の単位発熱量","燃料の排出係数","電力の排出係数"],"not_rendered":{"charts":0,"images":5,"macros":1,"external_links":0,"defined_names":19,"comments":1,"pivot_tables":0},"unopened":[],"bounds":{"document_bytes":16777216,"sheet_cells":100000,"rows_first":2000,"rows_last":500,"rows_between":2000,"halvings":0,"cell_chars":16384,"cell_head_chars":4096},"cells_cut":0,"cells_raw":0,"read":"whole","date_system":"1900"}

{"sheet":"使い方","index":0,"n_rows":31,"n_cols":4,"rows_kept":31,"cut":false,"hidden":false,"merged":[]}
[null,"【　シミュレーターの使い方　】"]
[null,"【AG-004：バイオ炭の農地施用】"]
[]
[null,"■入力用シート",null,"☜ クリックするとページにジャンプします。"]
[null,"モニタリング項目を入力することで、排出削減量が確認できます。"]
[]
[]
[]
[]
[]
[]
[]
[]
[]
[]
[]
[]
[]
[]
[]
[]
[]
[]
[]
[]
[]
[]
[]
[]
[null,"■計算方法",null,"☜ クリックするとページにジャンプします。"]
[null,"ベースライン排出量やプロジェクト実施後の排出量と計算式が確認できます。"]

{"sheet":"入力用シート","index":1,"n_rows":113,"n_cols":9,"rows_kept":113,"cut":false,"hidden":false,"merged":[[99,1,100,1],[99,2,100,2],[99,3,99,4],[99,5,100,5],[100,3,100,4],[66,5,67,5],[67,3,67,4],[68,3,68,4],[81,3,81,4],[112,2,112,7],[87,7,88,7],[87,6,88,6],[90,2,91,2],[90,3,90,4],[87,5,88,5],[82,3,82,4],[83,3,83,4],[110,1,111,1],[110,2,111,2],[110,3,110,4],[37,3,37,4],[109,3,109,4],[102,1,103,1],[102,2,103,2],[102,3,102,4],[104,1,105,1],[104,2,105,2],[104,3,104,4],[108,3,108,4],[89,3,89,4],[101,3,101,4],[98,3,98,4],[90,1,91,1],[92,1,93,1],[92,2,93,2],[92,3,92,4],[86,3,86,4],[87,1,88,1],[87,2,88,2],[87,3,87,4],[77,1,78,1],[77,2,78,2],[77,3,77,4],[76,3,76,4],[69,1,70,1],[69,2,70,2],[69,3,69,4],[71,1,72,1],[71,2,72,2],[71,3,71,4],[59,1,60,1],[59,2,60,2],[59,3,59,4],[75,3,75,4],[65,3,65,4],[66,1,67,1],[66,2,67,2],[66,3,66,4],[54,5,55,5],[54,6,55,6],[54,7,55,7],[56,3,56,4],[57,1,58,1],[57,2,58,2],[57,3,57,4],[48,3,48,4],[49,3,49,4],[50,3,50,4],[53,3,53,4],[54,1,55,1],[54,2,55,2],[54,3,54,4],[22,3,22,4],[21,3,21,4],[47,3,47,4],[23,3,23,4],[26,3,26,4],[29,3,29,4],[30,3,30,4],[33,3,33,4],[38,3,38,4],[39,3,39,4],[40,3,40,4],[45,3,45,4],[46,3,46,4],[3,7,3,8],[13,3,13,4],[14,3,14,4],[15,3,15,4],[16,3,16,4]]}
[]
[null,null,"　　【AG-004：バイオ炭の農地施用】"]
[null,null,"　　【黄色セルを上から順に、リストから選択または数値をご記入ください。】"]
[null,null,null,null,null,null,null,"自動入力"]
[null,null,null,null,null,null,null,"プロジェクト実施者が入力"]
[]
[null,null,"排出削減量(t-CO2)",{"$f":"計算方法!D8","v":{"$error":"#N/A"}},null,null,null,"☜下記の黄色セルを入力することで、最終的に排出削減量が計算されます。"]
[]
[]
[]
[]
[null,null,"1) プロジェクト実施後貯留量の算定"]
[]
[null,"記号","定義","数値",null,"単位","計算式","備考"]
[null,"STPJ","プロジェクト実施後貯留量",{"$f":"D16+D17","v":0},null,"tCO2","プロジェクト実施後貯留量= プロジェクト実施後貯留量（バイオ炭①）＋プロジェクト実施後貯留量（バイオ炭②）","「プロジェクト実施後貯留量（バイオ炭①）」、「プロジェクト実施後貯留量（バイオ炭②）」に基づき、自動で入力されます。"]
[null,"STPJ","プロジェクト実施後貯留量（バイオ炭①）",{"$f":"D24*IF(D23=\"その他\",E25,D25)*IF(D23=\"その他\",E26,D26)*44/12","v":0},null,"tCO2","プロジェクト実施後貯留量（バイオ炭①） = 土壌に投入されたバイオ炭の量×種類 i-① のバイオ炭の炭素含有率×種類 i -①のバイオ炭の 100 年後の炭素残存率× 炭素重量（tC）を CO2 重量（tCO2）に変換するための係数","自動で計算されます。"]
[null,"STPJ","プロジェクト実施後貯留量（バイオ炭②）",{"$f":"IF(D30=0,0,D31*IF(D30=\"その他\",E32,D32)*IF(D30=\"その他\",E33,D33)*44/12)","v":0},null,"tCO2","プロジェクト実施後貯留量（バイオ炭②） = 土壌に投入されたバイオ炭の量×種類 i-② のバイオ炭の炭素含有率×種類 i -②のバイオ炭の 100 年後の炭素残存率× 炭素重量（tC）を CO2 重量（tCO2）に変換するための係数","自動で計算されます。"]
[]
[null,null,"以下はバイオ炭の種類毎に記入をお願いします。（例：二種類使用した場合は、①と②に記入してください。）"]
[]
[null,null,"バイオ炭①について回答して下さい。"]
[null,"記号","定義","数値",null,"単位","計算式","備考"]
[null,"i-①","バイオ炭の種類（品名、又は原料及び製炭温度により特定）",null,null,null,"―","選択肢から選択してください。"]
[null,"BCtotal,i-①","土壌に投入されたバイオ炭の量",null,null,"tC","―","投入量を入力ください。"]
[null,"FC,i-①","① のバイオ炭の炭素含有率",{"$f":"_xlfn.IFNA(VLOOKUP($D$23,バイオ炭の種類!$A$2:$C$14,2,FALSE),0)","v":0},null,"%","―","「バイオ炭の種類」を選択すると自動で入力されます。\n「その他」を選択した場合は、任意の数値を記入ください。"]
[null,"Fperm,i-①","①のバイオ炭の 100 年後の炭素残存率",{"$f":"_xlfn.IFNA(VLOOKUP($D$23,バイオ炭の種類!$A$2:$C$14,3,FALSE),0)","v":0},null,"%","―","「バイオ炭の種類」を選択すると自動で入力されます。\n「その他」を選択した場合は、任意の数値を記入ください。"]
[null,"44/12","炭素重量（tC）を CO2 重量（tCO2）に変換するための係数","―",null,"―","―","ー"]
[]
[null,null,"バイオ炭②について回答して下さい。"]
[null,"i-②","バイオ炭の種類（品名、又は原料及び製炭温度により特定）",null,null,null,"―","選択肢から選択してください。"]
[null,"BCtotal,i-②","土壌に投入されたバイオ炭の量",null,null,"tC","―","投入量を入力ください。"]
[null,"FC,i-②","②のバイオ炭の炭素含有率",{"$f":"_xlfn.IFNA(VLOOKUP($D$30,バイオ炭の種類!$A$2:$C$14,2,FALSE),0)","v":0},null,"%","―","「バイオ炭の種類」を選択すると自動で入力されます。\n「その他」を選択した場合は、任意の数値を記入ください。"]
[null,"Fperm,i-②","②のバイオ炭の 100 年後の炭素残存率",{"$f":"_xlfn.IFNA(VLOOKUP($D$30,バイオ炭の種類!$A$2:$C$14,3,FALSE),0)","v":0},null,"%","―","「バイオ炭の種類」を選択すると自動で入力されます。\n「その他」を選択した場合は、任意の数値を記入ください。"]
[null,"44/12","炭素重量（tC）を CO2 重量（tCO2）に変換するための係数","―",null,"―","―","ー"]
[]
[]
[null,null,"2) プロジェクト実施後排出量の算定"]
[null,"記号","定義","数値",null,"単位","計算式","備考"]
[null,"EMPJ","プロジェクト排出量",{"$f":"D41","v":{"$error":"#REF!"}},null,"tCO2","プロジェクト排出量 =プロジェクトの主要排出量+プロジェクトの付随的な排出量","「プロジェクトの付随的な排出量」に基づき、自動で入力されます。"]
[null,"EMPJ,M","プロジェクトの主要排出量","―",null,"tCO2","―","該当なし"]
[null,"EMPJ,S","プロジェクトの付随的な排出量",{"$f":"D47","v":{"$error":"#REF!"}},null,"tCO2","―","「プロジェクト実施後の付随的な排出量」に基づき、自動で入力されます。"]
[]
[null,null,"＜主要排出活動＞"]
[null,null,"該当なし"]
[null,null,"＜付随的な排出活動＞"]
[null,"記号","定義","数値",null,"単位","計算式","備考"]
[null,"EMPJ,S","プロジェクト実施後の付随的な排出量",{"$f":"D48+D49+D50+D51","v":{"$error":"#REF!"}},null,"tCO2/年","プロジェクト実施後の付随的な排出量=バイオ炭原料の運搬によるプロジェクト実施後排出量+バイオ炭製造設備の使用によるプロジェクト実施後排出量+バイオ炭の運搬によるプロジェクト実施後排出量+機械によるバイオ炭の施用によるプロジェクト実施後排出量","自動で入力されます。"]
[null,"EMPJ,S,transport,feedstock","バイオ炭原料の運搬によるプロジェクト実施後排出量",{"$f":"IF(D55=\"バイオ炭の運搬による\",D56,E56)","v":0},null,"tCO2/年","―","自動で入力されます。","バイオ炭原料の採取場所からバイオ炭製造場所までの運搬に伴う化石燃料の使用による排出量の貯留量に対する影響を算定する。なお、剪定枝を有効利用する場合や燃料用炭の副生物を有効利用する場合等、原料の運搬に関して本プロジェクトの有無に依らない活動については算定を省略する。"]
[null,"EMPJ,S,process","バイオ炭製造設備の使用によるプロジェクト実施後排出量",{"$f":"IF(#REF!=0,#REF!,#REF!)","v":{"$error":"#REF!"}},null,"tCO2/年","―","自動で入力されます。","バイオ炭製造に際して電力や化石燃料を使用する場合、それに係る付随的排出量の貯留量に対する影響を算定する。自燃式やバイオマス燃料を用いる場合、燃料炭の副生物を有効利用する場合は算\n定を省略する。"]
[null,"EMPJ,S,transport,biochar","バイオ炭の運搬によるプロジェクト実施後排出量",{"$f":"IF(D88=\"バイオ炭の運搬による\",D89,E89)","v":0},null,"tCO2/年","―","自動で入力されます。","バイオ炭原料の採取場所からバイオ炭製造場所までの運搬に伴う化石燃料の使用による排出量の貯留量に対する影響を算定する。なお、剪定枝を有効利用する場合や燃料用炭の副生物を有効利用する場合等、原料の運搬に関して本プロジェクトの有無に依らない活動については算定を省略する"]
[null,"EMPJ,S,fertilize","機械によるバイオ炭の施用によるプロジェクト実施後排出量",{"$f":"IF(#REF!=0,#REF!,#REF!)","v":{"$error":"#REF!"}},null,"tCO2/年","―","自動で入力されます。"]
[]
[null,null,"a) バイオ炭原料の運搬によるプロジェクト実施後排出量"]
[null,"記号","定義","数値",null,"単位","計算式","備考"]
[null,"EMPJ,S,transport,feedstock","バイオ炭原料の運搬によるプロジェクト実施後排出量",null,null,"tCO2/年","バイオ炭原料の運搬によるプロジェクト実施後排出量=プロジェクト実施後のバイオ炭原料の運搬における燃料使用量× プロジェクト実施後のバイオ炭原料の運搬に使用する燃料の単位発熱量×プロジェクト実施後のバイオ炭原料の運搬に使用する燃料の単位発熱量当たりの CO2 排出係数","選択肢から選択してください。\n「燃費法」又は「トンキロ法」を使用する場合には、任意の数値を記入ください。"]
[null,null,null,{"$f":"D57*IF(D58=\"その他\",E59,D59)*IF(D60=\"その他\",E61,D61)","v":0}]
[null,"FPJ,transport,feedstock","プロジェクト実施後のバイオ炭原料の運搬における燃料使用量",null,null,"kL/年","―","燃料使用量を入力ください。"]
[null,"HVPJ,transport,feedstock","プロジェクト実施後のバイオ炭原料の運搬に使用する燃料の単位発熱量",null,null,"ー",null,"選択肢から選択してください。"]
[null,null,null,{"$f":"_xlfn.IFNA(VLOOKUP(D58,燃料の単位発熱量!$A$1:$C$28,2,FALSE),0)","v":0},null,"GJ/kL","―","「その他」を選択した場合は、任意の数値を記入ください。"]
[null,"CEFPJ,transport,feedstock","プロジェクト実施後のバイオ炭原料の運搬に使用する燃料の単位発熱量当たりの CO2 排出係数",null,null,"ー",null,"選択肢から選択してください。"]
[null,null,null,{"$f":"_xlfn.IFNA(VLOOKUP(D60,燃料の排出係数!$A$1:$C$28,2,FALSE),0)","v":0},null,"tCO2/GJ","―","「その他」を選択した場合は、任意の数値を記入ください。"]
[]
[]
[null,null,"b) バイオ炭製造設備の使用によるプロジェクト実施後排出量"]
[null,null,"b-1) 化石燃料を使用する場合"]
[null,"記号","定義","数値",null,"単位","計算式","備考"]
[null,"EMPJ,S,process","バイオ炭製造設備の使用によるプロジェクト実施後排出量",{"$f":"IF(D70=0,0,D69*(D77/D70)*IF(D76=\"その他\",#REF!,#REF!)*IF(#REF!=\"その他\",#REF!,#REF!))","v":0},null,"tCO2/年","バイオ炭製造設備の使用によるプロジェクト実施後排出量=プロジェクト実施後のすべてのバイオ炭製造における燃料使用量×プロジェクト実施後における当該プロジェクト用に製造されたバイオ炭の重量/プロジェクト実施後における製造されたすべてのバイオ炭の重量×プロジェクト実施後のバイオ炭製造に使用する燃料の単位発熱量×プロジェクト実施後のバイオ炭製造に使用する燃料のCO2 排出係数","自動で入力されます。\nb-1) 化石燃料を使用する場合"]
[null,null,null,{"$f":"IF(D70=0,0,D75*(D77/D70)*IF(D71=\"その他\",E72,D72))","v":0},null,null,"バイオ炭製造設備の使用によるプロジェクト実施後排出量=プロジェクト実施後のすべてのバイオ炭製造における電力使用量× プロジェクト実施後における当該プロジェクト用に製造されたバイオ炭の重量/プロジェクト実施後における製造されたすべてのバイオ炭の重量×電力の CO2 排出係数","自動で入力されます。\nb-2) 電力を使用する場合"]
[null,"FPJ,process","プロジェクト実施後のすべてのバイオ炭製造における燃料使用量",null,null,"kL/年, t/年, m3/年等","―","【燃料を使用する場合】\n使用量を入力ください。"]
[null,"HVPJ,process","プロジェクト実施後のバイオ炭製造に使用する燃料の単位発熱量",null,null,"ー",null,"【燃料を使用する場合】\n選択肢から選択してください。"]
[null,null,null,{"$f":"_xlfn.IFNA(VLOOKUP(D70,燃料の単位発熱量!$A$1:$C$28,2,FALSE),0)","v":0},null,"GJ/kL, GJ/t,\nGJ/ m3 等","―","【燃料を使用する場合】\n「その他」を選択した場合は、任意の数値を記入ください。"]
[null,"CEFPJ,process","プロジェクト実施後のバイオ炭製造に使用する燃料のCO2 排出係数",null,null,"ー",null,"【燃料を使用する場合】\n選択肢から選択してください。"]
[null,null,null,{"$f":"_xlfn.IFNA(VLOOKUP(D72,燃料の排出係数!$A$1:$C$28,2,FALSE),0)","v":0},null,"tCO2/GJ","―","【燃料を使用する場合】\n「その他」を選択した場合は、任意の数値を記入ください。"]
[]
[null,null,"b-2) 電力を使用する場合"]
[null,"記号","定義","数値",null,"単位","計算式","備考"]
[null,"ELPJ,process","プロジェクト実施後のすべてのバイオ炭製造における電力使用量",null,null,"kWh/年","―","【電力を使用する場合】\n電力使用量を入力ください。"]
[null,"CEFelectricity,t","電力の CO2 排出係数",null,null,"ー",null,"【電力を使用する場合】\n選択肢から選択してください。"]
[null,null,null,{"$f":"_xlfn.IFNA(VLOOKUP(D78,電力の排出係数!$A$1:$B$12,2,FALSE),0)","v":0},null,"tCO2/kWh","―","【電力を使用する場合】\n「その他」を選択した場合は、任意の数値を記入ください。"]
[]
{"$rows_left_out":34}
{"sheet":"計算方法","index":2,"n_rows":112,"n_cols":9,"rows_kept":112,"cut":false,"hidden":false,"merged":[[1,7,1,8],[1,4,1,5],[83,7,84,7],[83,1,84,1],[83,2,84,2],[83,3,83,4],[83,5,84,5],[83,6,84,6],[56,3,56,4],[68,3,68,4],[69,3,69,4],[70,3,70,4],[71,3,71,4],[67,3,67,4],[57,3,57,4],[59,3,59,4],[102,3,102,4],[104,3,104,4],[111,3,111,4],[96,3,96,4],[97,3,97,4],[110,3,110,4],[88,3,88,4],[98,3,98,4],[99,3,99,4],[100,3,100,4],[76,3,76,4],[77,3,77,4],[78,3,78,4],[85,3,85,4],[86,3,86,4],[82,3,82,4],[95,3,95,4],[49,3,49,4],[50,3,50,4],[29,3,29,4],[32,3,32,4],[38,3,38,4],[37,3,37,4],[39,3,39,4],[17,3,17,4],[22,3,22,4],[46,3,46,4],[47,3,47,4],[48,3,48,4],[8,3,8,4],[9,3,9,4],[10,3,10,4],[15,3,15,4],[16,3,16,4],[57,1,58,1],[57,2,58,2],[59,1,60,1],[59,2,60,2],[68,2,69,2],[68,5,69,5],[68,1,69,1],[96,1,97,1],[96,2,97,2],[96,5,97,5],[72,1,73,1],[72,2,73,2],[74,1,75,1],[74,2,75,2],[78,1,79,1],[78,2,79,2],[86,1,87,1],[86,2,87,2],[88,1,89,1],[72,3,72,4],[74,3,74,4],[104,1,105,1],[104,2,105,2],[88,2,89,2],[100,1,101,1],[100,2,101,2],[102,1,103,1],[102,2,103,2],[54,2,55,2],[54,1,55,1],[54,3,54,4],[54,7,55,7],[54,6,55,6],[54,5,55,5],[6,3,6,4],[14,3,14,4],[36,3,36,4],[45,3,45,4],[53,3,53,4],[25,3,25,4],[21,3,21,4],[28,3,28,4],[7,3,7,4]]}
[null,"計算方法：バイオ炭の農地施用",null,"　　【自動で計算されます。】"]
[null,null,null,null,"自動入力"]
[]
[]
[]
[null,"1．貯留量の算定"]
[null,"記号","定義","数値",null,"単位","計算式","備考","メモ"]
[null,"STtotal","貯留量",{"$f":"D9-D10-D11","v":{"$error":"#N/A"}},null,"tCO2","STtotal = STPJ － STBL － EMPJ","「プロジェクト実施後貯留量」 、 「ベースライン貯留量 」、 「プロジェクト排出量 」に基づき、自動で入力されます。"]
[null,"STPJ","プロジェクト実施後貯留量",{"$f":"D16","v":{"$error":"#N/A"}},null,"tCO2","―","「プロジェクト実施後貯留量」に基づき、自動で入力されます。"]
[null,"STBL","ベースライン貯留量",{"$f":"D112","v":0},null,"tCO2","―","「ベースライン貯留量 」に基づき、自動で入力されます。"]
[null,"EMPJ","プロジェクト実施後排出量",{"$f":"D38","v":{"$error":"#N/A"}},null,"tCO2","―","「プロジェクト排出量 」に基づき、自動で入力されます。"]
[]
[]
[null,"2．プロジェクト実施後貯留量の算定"]
[null,"記号","定義","数値",null,"単位","計算式","備考"]
[null,"STPJ","プロジェクト実施後貯留量",{"$f":"D17+D18","v":{"$error":"#N/A"}},null,"tCO2","STPJ = ΣiBCtotal,I × FC,i × Fperm,i × 44/12","「プロジェクト実施後貯留量（バイオ炭①）」、「プロジェクト実施後貯留量（バイオ炭②）」に基づき、自動で入力されます。"]
[null,"STPJ","プロジェクト実施後貯留量（バイオ炭①）",{"$f":"D23*IF(D22=\"その他\",E24,D24)*IF(D22=\"その他\",E25,D25)*44/12","v":{"$error":"#N/A"}},null,"tCO2","STPJ = iBCtotal,I × FC,i × Fperm,i × 44/12","自動で計算されます。"]
[null,"STPJ","プロジェクト実施後貯留量（バイオ炭②）",{"$f":"IF(D29=0,0,D30*IF(D29=\"その他\",E31,D31)*IF(D29=\"その他\",E32,D32)*44/12)","v":0},null,"tCO2","STPJ = iBCtotal,I × FC,i × Fperm,i × 44/12","自動で計算されます。"]
[]
[]
[null,"バイオ炭①"]
[null,"i-①","バイオ炭の種類（品名、又は原料及び製炭温度により特定）",{"$f":"入力用シート!D23","v":0},null,null,"―","選択肢から選択してください。"]
[null,"BCtotal,i-①","土壌に投入されたバイオ炭の量",{"$f":"入力用シート!D24","v":0},null,"tC","―","投入量を入力ください。"]
[null,"FC,i-①","種類 i-① のバイオ炭の炭素含有率",{"$f":"VLOOKUP($D$22,バイオ炭の種類!$A$2:$C$14,2,FALSE)","v":{"$error":"#N/A"}},{"$f":"入力用シート!E25","v":0},"%","―","「バイオ炭の種類」を選択すると自動で入力されます。\n「その他」を選択した場合は、任意の数値を記入ください。"]
[null,"Fperm,i-①","種類 i -①のバイオ炭の 100 年後の炭素残存率",{"$f":"VLOOKUP($D$22,バイオ炭の種類!$A$2:$C$14,3,FALSE)","v":{"$error":"#N/A"}},{"$f":"入力用シート!E26","v":0},"%","―","「バイオ炭の種類」を選択すると自動で入力されます。\n「その他」を選択した場合は、任意の数値を記入ください。"]
[null,"44/12","炭素重量（tC）を CO2 重量（tCO2）に変換するための係数","―",null,"―","―","ー"]
[]
[null,"バイオ炭②"]
[null,"i-②","バイオ炭の種類（品名、又は原料及び製炭温度により特定）",{"$f":"入力用シート!D30","v":0},null,null,"―","選択肢から選択してください。"]
[null,"BCtotal,i-②","土壌に投入されたバイオ炭の量",{"$f":"入力用シート!D31","v":0},null,"tC","―","投入量を入力ください。"]
[null,"FC,i-②","種類 i -②のバイオ炭の炭素含有率",{"$f":"VLOOKUP($D$29,バイオ炭の種類!$A$2:$C$14,2,FALSE)","v":{"$error":"#N/A"}},{"$f":"入力用シート!E32","v":0},"%","―","「バイオ炭の種類」を選択すると自動で入力されます。\n「その他」を選択した場合は、任意の数値を記入ください。"]
[null,"Fperm,i-②","種類 i -②のバイオ炭の 100 年後の炭素残存率",{"$f":"VLOOKUP($D$29,バイオ炭の種類!$A$2:$C$14,3,FALSE)","v":{"$error":"#N/A"}},{"$f":"入力用シート!E33","v":0},"%","―","「バイオ炭の種類」を選択すると自動で入力されます。\n「その他」を選択した場合は、任意の数値を記入ください。"]
[null,"44/12","炭素重量（tC）を CO2 重量（tCO2）に変換するための係数","―",null,"―","―","ー"]
[]
[]
[null,"3．プロジェクト実施後排出量の算定"]
[null,"記号","定義","数値",null,"単位","計算式","備考"]
[null,"EMPJ","プロジェクト排出量",{"$f":"D40","v":{"$error":"#N/A"}},null,"tCO2","EMPJ = EMPJ,M + EMPJ,S","「プロジェクトの付随的な排出量」に基づき、自動で入力されます。"]
[null,"EMPJ,M","プロジェクトの主要排出量","―",null,"tCO2","―","該当なし"]
[null,"EMPJ,S","プロジェクトの付随的な排出量",{"$f":"D47","v":{"$error":"#N/A"}},null,"tCO2","―","「プロジェクト実施後の付随的な排出量」に基づき、自動で入力されます。"]
[]
[null,"＜主要排出活動＞"]
[null,"該当なし"]
[]
[null,"＜付随的な排出活動＞"]
[null,"記号","定義","数値",null,"単位","計算式","備考"]
[null,"EMPJ,S","プロジェクト実施後の付随的な排出量",{"$f":"D48+D49+D50+D51","v":{"$error":"#N/A"}},null,"tCO2/年","EMPL,S = EMPJ,S,transport,feedstock + EMPJ,S,process + EMPJ,S,transport,biochar + EMPJ,S,fertilize","自動で入力されます。"]
[null,"EMPJ,S,transport,feedstock","バイオ炭原料の運搬によるプロジェクト実施後排出量",{"$f":"IF(D55=\"バイオ炭原料の運搬による\",D56,E56)","v":0},null,"tCO2/年","―","自動で入力されます。","バイオ炭原料の採取場所からバイオ炭製造場所までの運搬に伴う化石燃料の使用による排出量の貯留量に対する影響を算定する。なお、剪定枝を有効利用する場合や燃料用炭の副生物を有効利用する場合等、原料の運搬に関して本プロジェクトの有無に依らない活動については算定を省略する。"]
[null,"EMPJ,S,process","バイオ炭製造設備の使用によるプロジェクト実施後排出量",{"$f":"IF(D69=0,D70,D69)","v":0},null,"tCO2/年","―","自動で入力されます。","バイオ炭製造に際して電力や化石燃料を使用する場合、それに係る付随的排出量の貯留量に対する影響を算定する。自燃式やバイオマス燃料を用いる場合、燃料炭の副生物を有効利用する場合は算\n定を省略する。"]
[null,"EMPJ,S,transport,biochar","バイオ炭の運搬によるプロジェクト実施後排出量",{"$f":"IF(D84=\"バイオ炭の運搬による\",D85,E85)","v":0},null,"tCO2/年","―","自動で入力されます。","バイオ炭原料の採取場所からバイオ炭製造場所までの運搬に伴う化石燃料の使用による排出量の貯留量に対する影響を算定する。なお、剪定枝を有効利用する場合や燃料用炭の副生物を有効利用する場合等、原料の運搬に関して本プロジェクトの有無に依らない活動については算定を省略する"]
[null,"EMPJ,S,fertilize","機械によるバイオ炭の施用によるプロジェクト実施後排出量",{"$f":"IF(D97=0,D98,D97)","v":{"$error":"#N/A"}},null,"tCO2/年","―","自動で入力されます。"]
[]
[null,"a) バイオ炭原料の運搬によるプロジェクト実施後排出量"]
[null,"記号","定義","数値",null,"単位","計算式","備考"]
[null,"EMPJ,S,transport,feedstock","バイオ炭原料の運搬によるプロジェクト実施後排出量",{"$f":"入力用シート!D55","v":0},null,"tCO2/年","EMPJ,S,transport,feedstock = FPJ,transport,feedstock × HVPJ,transport,feedstock × CEFPJ,transport,feedstock","選択肢から選択してください。"]
[null,null,null,{"$f":"D57*IF(D58=\"その他\",E59,D59)*IF(D60=\"その他\",E61,D61)","v":0},{"$f":"入力用シート!E56","v":0}]
[null,"FPJ,transport,feedstock","プロジェクト実施後のバイオ炭原料の運搬における燃料使用量",{"$f":"入力用シート!D57","v":0},null,"kL/年","―","燃料使用量を入力ください。"]
[null,"HVPJ,transport,feedstock","プロジェクト実施後のバイオ炭原料の運搬に使用する燃料の単位発熱量",{"$f":"入力用シート!D58","v":0},null,"ー",null,"選択肢から選択してください。"]
[null,null,null,{"$f":"_xlfn.IFNA(VLOOKUP(D58,燃料の単位発熱量!$A$1:$C$28,2,FALSE),0)","v":0},{"$f":"入力用シート!E59","v":0},"GJ/kL","―","「その他」を選択した場合は、任意の数値を記入ください。"]
[null,"CEFPJ,transport,feedstock","プロジェクト実施後のバイオ炭原料の運搬に使用する燃料の単位発熱量当たりの CO2 排出係数","分からない場合／未定の場合",null,"ー",null,"選択肢から選択してください。"]
[null,null,null,{"$f":"_xlfn.IFNA(VLOOKUP(D60,燃料の排出係数!$A$1:$C$28,2,FALSE),0)","v":7.5595999999999983E-2},{"$f":"入力用シート!E61","v":0},"tCO2/GJ","―","「その他」を選択した場合は、任意の数値を記入ください。"]
[]
[]
[null,"b) バイオ炭製造設備の使用によるプロジェクト実施後排出量"]
[null,"b-1) 化石燃料を使用する場合"]
[null,"b-2) 電力を使用する場合"]
[null,"b-3) 化石燃料を使用する場合、または、電力を使用する場合"]
[null,"記号","定義","数値",null,"単位","計算式","備考"]
[null,"EMPJ,S,process","バイオ炭製造設備の使用によるプロジェクト実施後排出量",{"$f":"IFERROR(IF(D78=0,0,D71*(D77/D78)*IF(D73=\"その他\",E74,D74)*IF(D75=\"その他\",E76,D76)),\"0\")","v":0},null,"tCO2/年","EMPJ,S,process = FPJ,process × PVPJ/PVPJ,all × HVPJ,process × CEFPJ,process","自動で入力されます。\nb-1) 化石燃料を使用する場合"]
[null,null,null,{"$f":"_xlfn.IFNA(IF(D78=0,0,D72*(D77/D78)*IF(D79=\"その他\",E80,D80)),0)","v":0},null,null,"EMPJ,S,process = ELPJ,process × PVPJ/PVPJ,all × CEFelectricity,t","自動で入力されます。\nb-2) 電力を使用する場合"]
[null,"FPJ,process","プロジェクト実施後のすべてのバイオ炭製造における燃料使用量",{"$f":"入力用シート!D69","v":0},null,"kL/年, t/年, m3/年等","―","【燃料を使用する場合】\n使用量を入力ください。"]
[null,"ELPJ,process","プロジェクト実施後のすべてのバイオ炭製造における電力使用量",{"$f":"入力用シート!D77","v":0},null,"kWh/年","―","【電力を使用する場合】\n電力使用量を入力ください。"]
[null,"HVPJ,process","プロジェクト実施後のバイオ炭製造に使用する燃料の単位発熱量",{"$f":"入力用シート!D70","v":0},null,"ー",null,"【燃料を使用する場合】\n選択肢から選択してください。"]
[null,null,null,{"$f":"VLOOKUP(D73,燃料の単位発熱量!$A$1:$C$28,2,FALSE)","v":{"$error":"#N/A"}},{"$f":"入力用シート!E71","v":0},"GJ/kL, GJ/t,\nGJ/ m3 等","―","【燃料を使用する場合】\n「その他」を選択した場合は、任意の数値を記入ください。"]
[null,"CEFPJ,process","プロジェクト実施後のバイオ炭製造に使用する燃料のCO2 排出係数",{"$f":"入力用シート!D72","v":0},null,"ー",null,"【燃料を使用する場合】\n選択肢から選択してください。"]
[null,null,null,{"$f":"VLOOKUP(D75,燃料の排出係数!$A$1:$C$28,2,FALSE)","v":{"$error":"#N/A"}},{"$f":"入力用シート!E73","v":0},"tCO2/GJ","―","【燃料を使用する場合】\n「その他」を選択した場合は、任意の数値を記入ください。"]
[null,"PVPJ","プロジェクト実施後における当該プロジェクト用に製造されたバイオ炭の重量",{"$f":"入力用シート!D83","v":0},null,"t/年","―","【燃料を使用する場合、または、電力を使用する場合】\n当該プロジェクト用に製造されたバイオ炭の重量を記載ください。"]
[null,"PVPJ,all","プロジェクト実施後における製造されたすべてのバイオ炭の重量",{"$f":"入力用シート!D84","v":0},null,"t/年","―","【燃料を使用する場合、または、電力を使用する場合】\n製造されたすべてのバイオ炭の重量を記載ください。"]
[null,"CEFelectricity,t","電力の CO2 排出係数",{"$f":"入力用シート!D78","v":0},null,"ー",null,"【電力を使用する場合】\n選択肢から選択してください。"]
[null,null,null,{"$f":"_xlfn.IFNA(VLOOKUP(D79,電力の排出係数!$A$1:$B$12,2,FALSE),0)","v":0},{"$f":"入力用シート!E79","v":0},"tCO2/kWh","―","【電力を使用する場合】\n「その他」を選択した場合は、任意の数値を記入ください。"]
{"$rows_left_out":33}
{"sheet":"バイオ炭の種類","index":3,"n_rows":14,"n_cols":3,"rows_kept":14,"cut":false,"hidden":true,"merged":[]}
[null,"炭素含有率（％）","100年後の炭素残存量（％）"]
["白炭",0.77,0.89]
["黒炭",0.77,0.89]
["竹炭",0.77800000000000002,0.65]
["粉炭",0.77,0.8]
["オガ炭",0.77,0.89]
["家畜ふん尿由来",0.38,0.65]
["木材由来",0.77,0.65]
["草本由来",0.65,0.65]
["もみ殻・稲わら由来",0.49,0.65]
["木の実由来",0.74,0.65]
["製紙汚泥・下水汚泥由来",0.35,0.65]
["分からない場合／未定の場合",{"$f":"SUM(B2:B12)/11","v":0.65800000000000014},{"$f":"SUM(C2:C12)/11","v":0.72909090909090923}]
["その他"]

{"sheet":"燃料の単位発熱量","index":4,"n_rows":28,"n_cols":3,"rows_kept":28,"cut":false,"hidden":true,"merged":[]}
[null,"2021 年度単位発熱量[GJ/単位]","換算係数（高位⇒低位発熱量）"]
["輸入原料炭",28.7,0.92100000000000004]
["国産一般炭",24.2,0.94299999999999995]
["輸入一般炭",26.1,0.95099999999999996]
["輸入無煙炭",27.8,0.96699999999999997]
["コークス",29,0.97699999999999998]
["原油",38.1,0.94099999999999995]
["ガソリン",33.4,0.93899999999999995]
["ナフサ",33.299999999999997,0.93799999999999994]
["ジェット燃料 ",36.299999999999997,0.93799999999999994]
["灯油",36.5,0.93899999999999995]
["軽油",38,0.94]
["A 重油",38.9,0.94399999999999995]
["B 重油",40.4,0.95]
["C 重油",41,0.95]
["潤滑油",40.200000000000003,0.94399999999999995]
["オイルコークス",34.1,0.98499999999999999]
["LPG",50.1,0.92700000000000005]
["天然ガス",41.9,0.91100000000000003]
["LNG",54.7,0.91100000000000003]
["都市ガス",43.7,0.91200000000000003]
["NGL・コンデンセート",34.5,0.93700000000000006]
["製油所ガス",50.3,0.92]
["コークス炉ガス",20.100000000000001,0.89700000000000002]
["高炉ガス",3.5,0.97799999999999998]
["転炉ガス",8.1999999999999993,0.998]
["分からない場合／未定の場合",{"$f":"SUM(B2:B26)/25","v":34.120000000000005},{"$f":"SUM(C2:C26)/25","v":0.94232000000000016}]
["その他"]

{"sheet":"燃料の排出係数","index":5,"n_rows":28,"n_cols":3,"rows_kept":28,"cut":false,"hidden":true,"merged":[]}
[null,"2021 年度\n排出係数\n[t-CO2/GJ]","換算係数\n（高位⇒低位\n発熱量ﾍﾞｰｽ）"]
["輸入原料炭",9.0200000000000002E-2,1.0860000000000001]
["国産一般炭",8.8700000000000001E-2,1.06]
["輸入一般炭",8.9099999999999999E-2,1.052]
["輸入無煙炭",9.5000000000000001E-2,1.034]
["コークス",0.1096,1.024]
["原油",6.9699999999999998E-2,1.0620000000000001]
["ガソリン",6.8599999999999994E-2,1.0649999999999999]
["ナフサ",6.8199999999999997E-2,1.0660000000000001]
["ジェット燃料 ",6.8199999999999997E-2,1.0660000000000001]
["灯油",6.8599999999999994E-2,1.0649999999999999]
["軽油",6.8900000000000003E-2,1.0640000000000001]
["A 重油",7.0800000000000002E-2,1.0589999999999999]
["B 重油",7.3300000000000004E-2,1.0529999999999999]
["C 重油",7.4099999999999999E-2,1.0529999999999999]
["潤滑油",7.2999999999999995E-2,1.06]
["オイルコークス",9.0899999999999995E-2,1.0149999999999999]
["LPG",5.9799999999999999E-2,1.0780000000000001]
["天然ガス",5.0999999999999997E-2,1.097]
["LNG",5.0999999999999997E-2,1.0980000000000001]
["都市ガス",5.1299999999999998E-2,1.097]
["NGL・コンデンセート",6.6699999999999995E-2,1.0669999999999999]
["製油所ガス",5.28E-2,1.087]
["コークス炉ガス",0.04,1.115]
["高炉ガス",9.64E-2,1.0229999999999999]
["転炉ガス",0.154,1.002]
["分からない場合／未定の場合",{"$f":"SUM(B2:B26)/25","v":7.5595999999999983E-2},{"$f":"SUM(C2:C26)/25","v":1.06192}]
["その他"]

{"sheet":"電力の排出係数","index":6,"n_rows":12,"n_cols":2,"rows_kept":12,"cut":false,"hidden":true,"merged":[]}
[null,"排出係数（kg-CO2/kWh）"]
["2013年度",0.56999999999999995]
["2014年度",0.55400000000000005]
["2015年度",0.53100000000000003]
["2016年度",0.51800000000000002]
["2017年度",0.496]
["2018年度",0.46200000000000002]
["2019年度",0.44500000000000001]
["2020年度",0.433]
["2021年度",0.434]
["分からない場合／未定の場合",{"$f":"SUM(B2:B10)/9","v":0.4936666666666667}]
["その他"]