{"text_format":"1","workbook":"xlsx","n_sheets":6,"sheets":["使い方","入力用シート","計算方法","Sheet1","プロジェクト実施水田の所在地域","係数表_2023"],"not_rendered":{"charts":0,"images":2,"macros":1,"external_links":0,"defined_names":19,"comments":0,"pivot_tables":0},"unopened":[],"bounds":{"document_bytes":16777216,"sheet_cells":100000,"rows_first":2000,"rows_last":500,"rows_between":2000,"halvings":0,"cell_chars":16384,"cell_head_chars":4096},"cells_cut":0,"cells_raw":0,"read":"whole","date_system":"1900"}

{"sheet":"使い方","index":0,"n_rows":32,"n_cols":4,"rows_kept":32,"cut":false,"hidden":false,"merged":[]}
[null,"【　シミュレーターの使い方　】"]
[null,"【AG-005：水稲栽培における中干し期間の延長】"]
[]
[null,"■入力用シート",null,"☜ クリックするとページにジャンプします。"]
[null,"モニタリング項目を入力することで、排出削減量が確認できます。"]
[]
[]
[]
[]
[]
[]
[]
[]
[]
[]
[]
[]
[]
[]
[]
[]
[]
[]
[]
[]
[]
[]
[]
[]
[]
[null,"■計算方法",null,"☜ クリックするとページにジャンプします。"]
[null,"ベースライン排出量やプロジェクト実施後の排出量と計算式が確認できます。"]

{"sheet":"入力用シート","index":1,"n_rows":28,"n_cols":8,"rows_kept":28,"cut":false,"hidden":false,"merged":[[9,1,9,2],[13,1,13,2]]}
[]
[null,null,"　【AG-005：水稲栽培における中干し期間の延長】"]
[null,null,"　　【黄色セルを上から順に、リストから選択または数値をご記入ください。】"]
[null,null,null,null,null,"自動入力"]
[null,null,null,null,null,"プロジェクト実施者が入力"]
[]
[null,null,"排出削減量(t-CO2)",{"$f":"計算方法!D8","v":7},null,"☜下記の黄色セルを入力することで、最終的に排出削減量が計算されます。"]
[]
[null,null,"1) 活動量のモニタリング"]
[null,"モニタリング項目",null,"数値","単位","備考","モニタリング方法例","モニタリング頻度"]
[null,"APJ","プロジェクト実施後の水稲作付面積（ha）",1.8,"ha","水稲の作付面積を入力ください。","・eMAFF 農地ナビ、実測、生産管理記録等で把握","作付一回ごとに 1 回"]
[]
[null,null,"2) 係数のモニタリング"]
[null,"モニタリング項目",null,"数値","単位","備考","モニタリング方法例","モニタリング頻度"]
[null,null,"プロジェクト実施水田の所在都道府県","秋田県",null,"選択肢から選択してください。","・eMAFF 農地ナビ、生産管理記録等で確認"]
[null,"ί","プロジェクト実施水田の所在地域",{"$f":"VLOOKUP(D15,プロジェクト実施水田の所在地域!A1:B47,2,)","v":"東北"},null,"選択肢から選択してください。","・eMAFF 農地ナビ、生産管理記録等で確認","初回検証申請時に1回"]
[null,null,"日減水深の測定結果（mm/日）",null,null,"日減水深の測定結果がある場合、入力ください。"]
[null,null,"調整係数",1.22]
[null,null,"調整後日減水深",{"$f":"IF(D17=\"\",\"\",D17*D18)","v":""},null,"自動で入力されます。"]
[null,null,"プロジェクト実施水田の排水性（測定する場合）",{"$f":"IF(D19=\"\", \"\", IF(D19>=12.5, \"4時間排除（12.5mm/日以上）\", IF(D19>=7.5, \"日排除（7.5mm/日以上12.5mm/日未満）\", \"排水不良（7.5mm/日未満）\")))","v":""},null,"自動で入力されます。"]
[null,"j","プロジェクト実施水田の排水性","4時間排除（12.5mm/日以上）",null,"選択肢から選択してください。\n原則としてデフォルト値の定められた 3 条件（排水不良・日排除・4 時間排除）のうち、当該水田の所在地域、施用有機物の条件で最低の排出係数となる条件となります。\n（日減水深の測定結果がある場合は、『プロジェクト実施水田の排水性（測定する場合）』と同じ選択肢を選択してください。）","・原則としてデフォルト値の定められた 3 条件（排水不良・日排除・4 時間排除）のうち、当該水田の所在地域、施用有機物の条件で最低の排出係数となる条件とする。ただし、1人の取組実施者が管理する水田ごとに 1 か所、水田の日減水深（田面水の浸透・蒸発速度（mm／日））を実測し、その結果に基づきより高い排出係数の条件とすることができる。","初回検証申請時に1回（ただし日減水深の実測により、2回目以降の検証申請時に更新することも可）"]
[null,null,null,{"$f":"D16&D21","v":"東北4時間排除（12.5mm/日以上）"}]
[null,null,"稲わら持ち出し量（kg/10a）",0,null,"稲わらの持ち出し量を入力ください。\n（全量すき込みの場合は、0と入力ください。）"]
[null,null,"稲わら発生量（kg/10a）",{"$f":"VLOOKUP(D15,係数表_2023!$H$2:$I$49,2,FALSE)","v":692.4},null,"自動で入力されます。"]
[null,null,"稲わらすき込み率（％）\n※90％以上の場合は90と出力される",{"$f":"IF(D23=\"\", \"\", IF(100*(1-(D23/D24))>=90, 90, IF(100*(1-(D23/D24))<0, 0, 100*(1-(D23/D24)))))","v":90},null,"自動で入力されます。"]
[null,null,"堆肥施用量（t/10a）",0.5,null,"堆肥施用量を入力ください。"]
[null,null,"※1t/10a以上の場合は1と出力される",{"$f":"IF(D26>1,1,D26)","v":0.5},null,"自動で入力されます。"]
[null,"GWPCH4","CH4 の地球温暖化係数",28,null,"ー","・デフォルト値を使用","【要求頻度】\n検証申請時に最新のものを使用"]

{"sheet":"計算方法","index":2,"n_rows":41,"n_cols":7,"rows_kept":41,"cut":false,"hidden":false,"merged":[[1,3,1,4]]}
[null,"計算方法：水稲栽培における中干し期間の延長",null,"　　【自動で計算されます。】"]
[null,null,null,"自動入力"]
[]
[null,"１．適用条件","計算式記載なし"]
[]
[null,"２．排出削減量の算定"]
[null,"記号","定義","数値","単位","計算式","備考"]
[null,"ER","排出削減量",{"$f":"ROUNDDOWN(D9-D10,0)","v":7},"tCO2e/年","ER = EMBL － EMPJ","ー"]
[null,"EMBL","ベースライン排出量",{"$f":"ROUND(D31,1)","v":23.9},"tCO2e/年","―","ー"]
[null,"EMPJ","プロジェクト実施後排出量",{"$f":"ROUND(D15,1)","v":16.7},"tCO2e/年","―","ー"]
[]
[]
[null,"３．プロジェクト実施後排出量の算定"]
[null,"記号","定義","数値","単位","計算式","備考"]
[null,"EMPJ","プロジェクト実施後排出量",{"$f":"D32*D17*16/12*D35*1/1000","v":16.699200000000001},"tCO2e/年","EMPJ = Σ(APJ × EFi,j,k,l,m1) × 16/12 × GWPCH4 × 10-3","ー"]
[null,"APJ","プロジェクト実施後の水稲作付面積",{"$f":"入力用シート!D11","v":1.8},"ha","―","ー"]
[null,"EFi,j,k,l,m1","プロジェクト実施後の CH4 排出係数",{"$f":"D33*(1-0.3)","v":248.49999999999997},"kg-CH4-C/ha/年","―","ー"]
[null,"16/12","CH4 中に含まれる炭素重量（kgCH4-C）を CH4重量（kgCH4）に変換するための係数","ー","kg-CH4/kg-CH4-C","―","ー"]
[null,"GWPCH4","CH4 の地球温暖化係数",{"$f":"入力用シート!D28","v":28},"tCO2e/tCH4","―","ー"]
[null,"10-3","単位換算","ー","tCH4/kg-CH4","―","ー"]
[]
[]
[null,"４．ベースライン排出量の考え方"]
[null,"記号","定義","数値","単位","計算式","備考"]
[null,"ABL","ベースラインの水稲作付面積",{"$f":"D16","v":1.8},"ha","ABL = APJ","ー"]
[null,"APJ","プロジェクト実施後の水稲作付面積",{"$f":"D16","v":1.8},"ha","―","ー"]
[]
[]
[null,"５．ベースライン排出量の算定"]
[null,"記号","定義","数値","単位","計算式","備考"]
[null,"EMBL","ベースライン排出量",{"$f":"D32*D33*16/12*D35*1/1000","v":23.856000000000002},"tCO2e/年","EMBL = Σ(ABL × EFi,j,k,l,m0) × 16/12 × GWPCH4 × 10-3","ー"]
[null,"ABL","ベースラインの水稲作付面積",{"$f":"D25","v":1.8},"ha","―","ー"]
[null,"EFi,j,k,l,m0","ベースラインの CH4 排出係数",{"$f":"IFERROR(MIN(MAX(D39,D40),D41+(D39-D41)*入力用シート!D25/90+(D40-D41)*入力用シート!D27),\"―\")","v":355},"kg-CH4-C/ha/年","―","ー"]
[null,"16/12","CH4 中に含まれる炭素重量（kgCH4-C）を CH4重量（kgCH4）に変換するための係数","ー","kg-CH4/kg-CH4-C","―","ー"]
[null,"GWPCH4","CH4 の地球温暖化係数",{"$f":"入力用シート!D28","v":28},"tCO2e/tCH4","―","ー"]
[null,"10-3","単位換算","ー","tCH4/kg-CH4","―","ー"]
[]
[null,"計算用"]
[null,"稲わら",null,{"$f":"VLOOKUP(入力用シート!D22,係数表_2023!$C$2:$F$23,2,FALSE)","v":355}]
[null,"堆肥",null,{"$f":"VLOOKUP(入力用シート!D22,係数表_2023!$C$2:$F$23,3,FALSE)","v":335}]
[null,"無施用",null,{"$f":"VLOOKUP(入力用シート!D22,係数表_2023!$C$2:$F$23,4,FALSE)","v":59}]

{"sheet":"Sheet1","index":3,"n_rows":0,"n_cols":0,"rows_kept":0,"cut":false,"hidden":true,"merged":[]}

{"sheet":"プロジェクト実施水田の所在地域","index":4,"n_rows":47,"n_cols":3,"rows_kept":47,"cut":false,"hidden":true,"merged":[]}
["北海道","北海道","排水不良（7.5mm/日未満）"]
["青森県","東北","日排除（7.5mm/日以上12.5mm/日未満）"]
["岩手県","東北","4時間排除（12.5mm/日以上）"]
["宮城県","東北"]
["秋田県","東北"]
["山形県","東北"]
["福島県","東北"]
["茨城県","関東"]
["栃木県","関東"]
["群馬県","関東"]
["埼玉県","関東"]
["千葉県","関東"]
["東京都","関東"]
["神奈川県","関東"]
["新潟県","北陸"]
["富山県","北陸"]
["石川県","北陸"]
["福井県","北陸"]
["山梨県","東海・近畿"]
["長野県","東海・近畿"]
["岐阜県","東海・近畿"]
["静岡県","東海・近畿"]
["愛知県","東海・近畿"]
["三重県","東海・近畿"]
["滋賀県","東海・近畿"]
["京都府","東海・近畿"]
["大阪府","東海・近畿"]
["兵庫県","東海・近畿"]
["奈良県","東海・近畿"]
["和歌山県","東海・近畿"]
["鳥取県","中国・四国"]
["島根県","中国・四国"]
["岡山県","中国・四国"]
["広島県","中国・四国"]
["山口県","中国・四国"]
["徳島県","中国・四国"]
["香川県","中国・四国"]
["愛媛県","中国・四国"]
["高知県","中国・四国"]
["福岡県","九州・沖縄"]
["佐賀県","九州・沖縄"]
["長崎県","九州・沖縄"]
["熊本県","九州・沖縄"]
["大分県","九州・沖縄"]
["宮崎県","九州・沖縄"]
["鹿児島県","九州・沖縄"]
["沖縄県","九州・沖縄"]

{"sheet":"係数表_2023","index":5,"n_rows":50,"n_cols":21,"rows_kept":50,"cut":false,"hidden":true,"merged":[[0,2,0,5]]}
[null,null,"CH4 排出係数［kg-CH4-C/ha］"]
[null,null,null,"稲わら","堆肥","無施用",null,null,"稲わら発生量\n(kg)","平年収量\n(kg)",null,null,null,null,null,null,{"$f":"16/12","v":1.3333333333333333}]
["北海道","排水不良（7.5mm/日未満）",{"$f":"A3&B3","v":"北海道排水不良（7.5mm/日未満）"},662,649,114,null,"北海道",{"$f":"J3*1.2","v":673.19999999999993},561,null,null,null,null,null,{"$f":"D3*$Q$2*28*0.001","v":24.714666666666666},{"$f":"E3*$Q$2*28*0.001","v":24.229333333333333},4.2560000000000002,{"$f":"P3*0.3","v":7.4143999999999997},{"$f":"Q3*0.3","v":7.2687999999999997},1.2767999999999999]
["北海道","日排除（7.5mm/日以上12.5mm/日未満）",{"$f":"A4&B4","v":"北海道日排除（7.5mm/日以上12.5mm/日未満）"},271,265,21,null,"青森県",{"$f":"J4*1.2","v":723.6},603,null,null,null,null,null,{"$f":"D4*$Q$2*28*0.001","v":10.117333333333333},{"$f":"E4*$Q$2*28*0.001","v":9.8933333333333326},{"$f":"F4*$Q$2*28*0.001","v":0.78400000000000003},{"$f":"P4*0.3","v":3.0351999999999997},2.9679999999999995,0.23519999999999999]
["北海道","4時間排除（12.5mm/日以上）","北海道4時間排除（12.5mm/日以上）",197,192,14,null,"岩手県",648,540,null,null,null,null,null,7.3546666666666658,7.1680000000000001,0.52266666666666661,2.2063999999999995,2.1503999999999999,0.15679999999999997]
["東北","排水不良（7.5mm/日未満）","東北排水不良（7.5mm/日未満）",711,673,153,null,"宮城県",649.19999999999993,541,null,null,null,null,null,26.544,25.125333333333334,5.7119999999999997,7.9631999999999996,7.5375999999999994,1.7135999999999998]
["東北","日排除（7.5mm/日以上12.5mm/日未満）","東北日排除（7.5mm/日以上12.5mm/日未満）",392,370,71,null,"秋田県",692.4,577,null,null,null,null,null,14.634666666666666,13.813333333333333,2.6506666666666665,4.3903999999999996,4.1439999999999992,0.79519999999999991]
["東北","4時間排除（12.5mm/日以上）","東北4時間排除（12.5mm/日以上）",355,335,59,null,"山形県",717.6,598,null,null,null,null,null,13.253333333333332,12.506666666666666,2.2026666666666666,3.9759999999999995,3.7519999999999998,0.66079999999999994]
["北陸","排水不良（7.5mm/日未満）","北陸排水不良（7.5mm/日未満）",515,412,33,null,"福島県",661.19999999999993,551,null,null,null,null,null,19.226666666666663,15.381333333333332,1.232,5.7679999999999989,4.6143999999999998,0.36959999999999998]
["北陸","日排除（7.5mm/日以上12.5mm/日未満）","北陸日排除（7.5mm/日以上12.5mm/日未満）",376,302,31,null,"茨城県",632.4,527,null,null,null,null,null,14.037333333333333,11.274666666666667,1.1573333333333333,4.2111999999999998,3.3824000000000001,0.34720000000000001]
["北陸","4時間排除（12.5mm/日以上）","北陸4時間排除（12.5mm/日以上）",332,266,22,null,"栃木県",648,540,null,null,null,null,null,12.394666666666666,9.9306666666666654,0.82133333333333325,3.7183999999999995,2.9791999999999996,0.24639999999999995]
["関東","排水不良（7.5mm/日未満）","関東排水不良（7.5mm/日未満）",224,235,17,null,"群馬県",597.6,498,null,null,null,null,null,8.3626666666666658,8.7733333333333317,0.6346666666666666,2.5087999999999995,2.6319999999999992,0.19039999999999999]
["関東","日排除（7.5mm/日以上12.5mm/日未満）","関東日排除（7.5mm/日以上12.5mm/日未満）",121,127,15,null,"埼玉県",592.79999999999995,494,null,null,null,null,null,4.5173333333333332,4.7413333333333334,0.56000000000000005,1.3552,1.4223999999999999,0.16800000000000001]
["関東","4時間排除（12.5mm/日以上）","関東4時間排除（12.5mm/日以上）",151,157,16,null,"千葉県",652.79999999999995,544,null,null,null,null,null,5.6373333333333333,5.8613333333333335,0.59733333333333327,1.6912,1.7584,0.17919999999999997]
["東海・近畿","排水不良（7.5mm/日未満）","東海・近畿排水不良（7.5mm/日未満）",378,345,21,null,"東京都",496.79999999999995,414,null,null,null,null,null,14.112,12.88,0.78400000000000003,4.2336,3.8639999999999999,0.23519999999999999]
["東海・近畿","日排除（7.5mm/日以上12.5mm/日未満）","東海・近畿日排除（7.5mm/日以上12.5mm/日未満）",95,87,2,null,"神奈川県",592.79999999999995,494,null,null,null,null,null,3.5466666666666664,3.2480000000000002,7.4666666666666659E-2,1.0639999999999998,0.97440000000000004,2.2399999999999996E-2]
["東海・近畿","4時間排除（12.5mm/日以上）","東海・近畿4時間排除（12.5mm/日以上）",128,116,6,null,"新潟県",655.19999999999993,546,null,null,null,null,null,4.7786666666666662,4.3306666666666658,0.224,1.4335999999999998,1.2991999999999997,6.7199999999999996E-2]
["中国・四国","排水不良（7.5mm/日未満）","中国・四国排水不良（7.5mm/日未満）",394,417,57,null,"富山県",656.4,547,null,null,null,null,null,14.709333333333332,15.568,2.1280000000000001,4.4127999999999989,4.6703999999999999,0.63839999999999997]
["中国・四国","日排除（7.5mm/日以上12.5mm/日未満）","中国・四国日排除（7.5mm/日以上12.5mm/日未満）",93,99,5,null,"石川県",627.6,523,null,null,null,null,null,3.472,3.6960000000000002,0.18666666666666665,1.0415999999999999,{"$f":"Q19*0.3","v":1.1088},{"$f":"R19*0.3","v":5.5999999999999994E-2}]
["中国・四国","4時間排除（12.5mm/日以上）","中国・四国4時間排除（12.5mm/日以上）",163,173,17,null,"福井県",622.79999999999995,519,null,null,null,null,null,6.0853333333333328,6.4586666666666659,0.6346666666666666,1.8255999999999997,1.9375999999999998,0.19039999999999999]
["九州・沖縄","排水不良（7.5mm/日未満）","九州・沖縄排水不良（7.5mm/日未満）",152,221,19,null,"山梨県",656.4,547,null,null,null,null,null,5.6746666666666661,8.2506666666666657,0.70933333333333326,1.7023999999999997,2.4751999999999996,0.21279999999999996]
["九州・沖縄","日排除（7.5mm/日以上12.5mm/日未満）","九州・沖縄日排除（7.5mm/日以上12.5mm/日未満）",82,121,7,null,"長野県",742.8,619,null,null,null,null,null,3.0613333333333332,4.5173333333333332,0.26133333333333331,0.91839999999999988,1.3552,7.8399999999999984E-2]
["九州・沖縄","4時間排除（12.5mm/日以上）","九州・沖縄4時間排除（12.5mm/日以上）",102,151,7,null,"岐阜県",582,485,null,null,null,null,null,3.8080000000000003,5.6373333333333333,0.26133333333333331,1.1424000000000001,1.6912,7.8399999999999984E-2]
[null,null,"NID-JPN-2024-v3.6_J_gioweb.pdf",null,null,null,null,"静岡県",624,520]
[null,null,"表5-45",null,null,null,null,"愛知県",608.4,507]
[null,null,null,null,null,null,null,"三重県",600,500]
[null,null,null,null,null,null,null,"滋賀県",621.6,518]
[null,null,null,null,null,null,null,"京都府",612,510]
[null,null,null,null,null,null,null,"大阪府",594,495]
[null,null,null,null,null,null,null,"兵庫県",601.19999999999993,501]
[null,null,null,null,null,null,null,"奈良県",615.6,513]
[null,null,null,null,null,null,null,"和歌山県",596.4,497]
[null,null,null,null,null,null,null,"鳥取県",616.79999999999995,514]
[null,null,null,null,null,null,null,"島根県",613.19999999999993,511]
[null,null,null,null,null,null,null,"岡山県",631.19999999999993,526]
[null,null,null,null,null,null,null,"広島県",633.6,528]
[null,null,null,null,null,null,null,"山口県",604.79999999999995,504]
[null,null,null,null,null,null,null,"徳島県",568.79999999999995,474]
[null,null,null,null,null,null,null,"香川県",595.19999999999993,496]
[null,null,null,null,null,null,null,"愛媛県",597.6,498]
[null,null,null,null,null,null,null,"高知県",547.19999999999993,456]
[null,null,null,null,null,null,null,"福岡県",595.19999999999993,496]
[null,null,null,null,null,null,null,"佐賀県",622.79999999999995,519]
[null,null,null,null,null,null,null,"長崎県",582,485]
[null,null,null,null,null,null,null,"熊本県",615.6,513]
[null,null,null,null,null,null,null,"大分県",598.79999999999995,499]
[null,null,null,null,null,null,null,"宮崎県",595.19999999999993,496]
[null,null,null,null,null,null,null,"鹿児島県",582,485]
[null,null,null,null,null,null,null,"沖縄県",370.8,309]
[null,null,null,null,null,null,null,"「令和5年産⽔稲の作柄表⽰地帯別10a当たり平年収量」及び「作況指数算定に用いるふるい目幅（令和6年産～8年産用）」について：農林水産省 (maff.go.jp)"]