{"text_format":"3","workbook":"xlsx","n_sheets":6,"sheets":["2005旧市町","2010旧市町村","2015旧市町村","2020旧市町村","2005_2020市町","グラフ"],"not_rendered":{"charts":2,"defined_names":4},"read":"whole","date_system":"1900"}

{"sheet":"2005旧市町","index":0,"n_rows":261,"n_cols":18,"rows_kept":261,"hidden":true}
["農業経営体",{"$nulls":3},"Ⅱ　農業経営体"]
["１ 組織形態別経営体数"]
[]
[]
[]
[]
[{"$nulls":17},"単位：経営体"]
["新旧市区町村",{"$nulls":3},"計","法人化している",{"$nulls":9},"地方公共\n団 体\n・\n財産区","法 人 化\n\nしてない "]
[{"$nulls":5},"小　計","農事組合\n\n法   人","会社",{"$nulls":3},"各種団体",null,null,"その他\n\nの法人"]
[{"$nulls":7},"株 式\n\n会 社","有 限\n\n会 社","合名・\n合  資  \n会  社 ","相 互\n\n会 社","農　協","森 林\n\n組 合","その他\nの各種\n団  体",{"$nulls":3},"個　 人\n\n経営体"]
[]
[]
["県計",null,null,"000-00",{"v":17121,"d":"17,121"},324,12,11,265,1,"-",30,"-",4,1,13,{"v":16784,"d":"16,784"},{"v":16764,"d":"16,764"}]
[null,"横浜市",null,"100-00",{"v":2726,"d":"2,726"},46,1,4,39,"-","-",2,"-","-","-",2,{"v":2678,"d":"2,678"},{"v":2676,"d":"2,676"}]
[null,"鶴見区",null,"101-00",32,"-","-","-","-","-","-","-","-","-","-","-",32,32]
[null,"神奈川区",null,"102-00",159,4,"-","-",4,"-","-","-","-","-","-","-",155,154]
[null,"西区",null,"103-00","-","-","-","-","-","-","-","-","-","-","-","-","-","-"]
[null,"中区",null,"104-00",4,1,"-","-","-","-","-",1,"-","-","-",2,1,1]
[null,"南区（南区２－１）",null,"105-00",3,"-","-","-","-","-","-","-","-","-","-","-",3,3]
[null,"保土ケ谷区",null,"106-00",103,1,"-","-",1,"-","-","-","-","-","-","-",102,102]
[null,null,"保土ケ谷区２－１","106-01",82,"-","-","-","-","-","-","-","-","-","-","-",82,82]
[null,null,"二俣川村２－１","106-02",2,"x","x","x","x","x","x","x","x","x","x","x","x","x"]
[null,null,"新治村２－１","106-03",19,"x","x","x","x","x","x","x","x","x","x","x","x","x"]
[null,"磯子区",null,"107-00",29,"-","-","-","-","-","-","-","-","-","-","-",29,29]
[null,"金沢区",null,"108-00",28,"-","-","-","-","-","-","-","-","-","-","-",28,28]
[null,"港北区",null,"109-00",286,"-","-","-","-","-","-","-","-","-","-","-",286,286]
[null,null,"港北","109-01",124,"-","-","-","-","-","-","-","-","-","-","-",124,124]
[null,null,"新田村２－１","109-02",162,"-","-","-","-","-","-","-","-","-","-","-",162,162]
[null,"戸塚区",null,"110-00",254,9,"-",1,8,"-","-","-","-","-","-","-",245,245]
[null,null,"戸塚町","110-01",26,1,"-","-",1,"-","-","-","-","-","-","-",25,25]
[null,null,"豊田村２－１","110-02",7,1,"-","-",1,"-","-","-","-","-","-","-",6,6]
[null,null,"川上村","110-03",55,2,"-","-",2,"-","-","-","-","-","-","-",53,53]
[null,null,"大正村２－１","110-04",138,5,"-",1,4,"-","-","-","-","-","-","-",133,133]
[null,null,"中川村３－１","110-05",28,"-","-","-","-","-","-","-","-","-","-","-",28,28]
[null,"港南区（南区２－２）",null,"111-00",53,1,"-",1,"-","-","-","-","-","-","-","-",52,52]
[null,"旭区",null,"112-00",200,2,"-","-",2,"-","-","-","-","-","-","-",198,198]
[null,null,"保土ケ谷区２－２","112-01",15,"-","-","-","-","-","-","-","-","-","-","-",15,15]
[null,null,"二俣川村２－２","112-02",81,2,"-","-",2,"-","-","-","-","-","-","-",79,79]
[null,null,"都岡村","112-03",104,"-","-","-","-","-","-","-","-","-","-","-",104,104]
[null,"緑区",null,"113-00",286,3,"-",1,2,"-","-","-","-","-","-","-",283,283]
{"$rows_left_out":222}
{"sheet":"2010旧市町村","index":1,"n_rows":256,"n_cols":17,"rows_kept":256,"hidden":true,"merged":[[7,0,11,3],[7,5,7,13],[7,14,11,14],[7,15,11,15],[8,5,11,5],[8,6,11,6],[8,7,8,9],[8,10,8,12],[8,13,11,13],[9,7,11,7],[9,8,11,8],[9,9,11,9],[9,10,11,10],[9,11,11,11],[9,12,11,12],[12,0,12,2],[13,1,13,2],[14,1,14,2],[15,1,15,2],[16,1,16,2],[17,1,17,2],[18,1,18,2],[19,1,19,2],[23,1,23,2],[24,1,24,2],[25,1,25,2],[28,1,28,2],[34,1,34,2],[35,1,35,2],[39,1,39,2],[43,1,43,2],[46,1,46,2],[49,1,49,2],[53,1,53,2],[59,1,59,2],[64,1,64,2],[65,1,65,2],[66,1,66,2],[67,1,67,2],[68,1,68,2],[73,1,73,2],[77,1,77,2],[80,1,80,2],[83,1,83,2],[93,1,93,2],[105,1,105,2],[109,1,109,2],[117,1,117,2],[134,1,134,2],[139,1,139,2],[140,1,140,2],[170,1,170,2],[174,1,174,2],[182,1,182,2],[191,1,191,2],[194,1,194,2],[202,1,202,2],[205,1,205,2],[206,1,206,2],[211,1,211,2],[212,0,212,2],[213,1,213,2],[214,0,214,2],[215,1,215,2],[216,0,216,2],[217,1,217,2],[220,1,220,2],[221,0,221,2],[222,1,222,2],[223,1,223,2],[227,1,227,2],[230,1,230,2],[236,1,236,2],[239,0,239,2],[240,1,240,2],[241,1,241,2],[244,1,244,2],[248,0,248,2],[249,1,249,2],[253,1,253,2]]}
["Ⅱ　農業経営体"]
["１　組織形態別経営体数"]
[""]
[""]
[]
[]
[{"$nulls":16},"単位：経営体"]
["新旧市区町村",{"$nulls":4},"法　　人　　化　　し　　て　　い　　る",{"$nulls":8},"地方公共団\n体・財産区","法人化し\nていない"]
[{"$nulls":5},"小　計","農事組合\n法　　人","会　　社",null,null,"各  種  団  体",null,null,"その他の\n法　　人"]
[{"$nulls":4},"計",null,null,"株式会社","合名・合資\n会　　　社","合同会社","農　　協","森林組合","その他の\n各種団体"]
[{"$nulls":16},"個人経営体"]
[]
["県計",null,null,"000-00",{"v":15612,"d":"15,612"},233,10,200,1,"-",17,"-",4,1,2,{"v":15377,"d":"15,377"},{"v":15370,"d":"15,370"}]
[null,"横浜市",null,"100-00",{"v":2531,"d":"2,531"},25,"-",23,"-","-",1,"-","-",1,"-",{"v":2506,"d":"2,506"},{"v":2506,"d":"2,506"}]
[null,"鶴見区",null,"101-00",25,1,"-",1,"-","-","-","-","-","-","-",24,24]
[null,"神奈川区",null,"102-00",152,4,"-",4,"-","-","-","-","-","-","-",148,148]
[null,"西区",null,"103-00","-","-","-","-","-","-","-","-","-","-","-","-","-"]
[null,"中区",null,"104-00",1,"X","X","X","X","X","X","X","X","X","X","X","X"]
[null,"南区（南区２－１）",null,"105-00",3,"X","X","X","X","X","X","X","X","X","X","X","X"]
[null,"保土ケ谷区",null,"106-00",100,1,"-",1,"-","-","-","-","-","-","-",99,99]
[null,null,"保土ケ谷区２－１","106-01",80,"-","-","-","-","-","-","-","-","-","-",80,80]
[null,null,"二俣川村２－１","106-02",1,"X","X","X","X","X","X","X","X","X","X","X","X"]
[null,null,"新治村２－１","106-03",19,"X","X","X","X","X","X","X","X","X","X","X","X"]
[null,"磯子区",null,"107-00",25,1,"-",1,"-","-","-","-","-","-","-",24,24]
[null,"金沢区",null,"108-00",31,"-","-","-","-","-","-","-","-","-","-",31,31]
[null,"港北区",null,"109-00",264,1,"-","-","-","-","-","-","-",1,"-",263,263]
[null,null,"港北","109-01",111,"-","-","-","-","-","-","-","-","-","-",111,111]
[null,null,"新田村２－１","109-02",153,1,"-","-","-","-","-","-","-",1,"-",152,152]
[null,"戸塚区",null,"110-00",243,6,"-",6,"-","-","-","-","-","-","-",237,237]
[null,null,"戸塚町","110-01",22,1,"-",1,"-","-","-","-","-","-","-",21,21]
[null,null,"豊田村２－１","110-02",6,1,"-",1,"-","-","-","-","-","-","-",5,5]
[null,null,"川上村","110-03",56,2,"-",2,"-","-","-","-","-","-","-",54,54]
[null,null,"大正村２－１","110-04",133,2,"-",2,"-","-","-","-","-","-","-",131,131]
[null,null,"中川村３－１","110-05",26,"-","-","-","-","-","-","-","-","-","-",26,26]
[null,"港南区（南区２－２）",null,"111-00",52,1,"-",1,"-","-","-","-","-","-","-",51,51]
[null,"旭区",null,"112-00",173,"-","-","-","-","-","-","-","-","-","-",173,173]
[null,null,"保土ケ谷区２－２","112-01",15,"-","-","-","-","-","-","-","-","-","-",15,15]
[null,null,"二俣川村２－２","112-02",71,"-","-","-","-","-","-","-","-","-","-",71,71]
[null,null,"都岡村","112-03",87,"-","-","-","-","-","-","-","-","-","-",87,87]
[null,"緑区",null,"113-00",264,2,"-",2,"-","-","-","-","-","-","-",262,262]
{"$rows_left_out":217}
{"sheet":"2015旧市町村","index":2,"n_rows":265,"n_cols":17,"rows_kept":265,"hidden":true,"merged":[[5,0,10,3],[5,5,5,13],[5,14,10,14],[5,15,10,15],[6,5,10,5],[6,6,10,6],[6,7,6,9],[6,10,6,12],[6,13,10,13],[7,4,8,4],[7,8,10,8],[7,12,10,12],[8,7,9,7],[8,9,9,9],[8,10,9,10],[8,11,9,11],[8,16,9,16],[12,0,12,2],[13,1,13,2],[14,1,14,2],[15,1,15,2],[16,1,16,2],[17,1,17,2],[18,1,18,2],[19,1,19,2],[23,1,23,2],[24,1,24,2],[25,1,25,2],[28,1,28,2],[34,1,34,2],[35,1,35,2],[39,1,39,2],[43,1,43,2],[46,1,46,2],[49,1,49,2],[53,1,53,2],[59,1,59,2],[64,1,64,2],[65,1,65,2],[66,1,66,2],[67,1,67,2],[68,1,68,2],[73,1,73,2],[77,1,77,2],[80,1,80,2],[83,1,83,2],[84,1,84,2],[108,1,108,2],[115,1,115,2],[122,1,122,2],[132,1,132,2],[144,1,144,2],[148,1,148,2],[156,1,156,2],[173,1,173,2],[178,1,178,2],[179,1,179,2],[183,1,183,2],[191,1,191,2],[200,1,200,2],[203,1,203,2],[211,1,211,2],[214,1,214,2],[215,1,215,2],[220,1,220,2],[221,0,221,2],[222,1,222,2],[223,0,223,2],[224,1,224,2],[225,0,225,2],[226,1,226,2],[229,1,229,2],[230,0,230,2],[231,1,231,2],[232,1,232,2],[236,1,236,2],[239,1,239,2],[245,1,245,2],[248,0,248,2],[249,1,249,2],[250,1,250,2],[253,1,253,2],[257,0,257,2],[258,1,258,2],[262,1,262,2]]}
["Ⅱ　農業経営体"]
["２　組織形態別経営体数"]
[]
[]
[{"$nulls":16},"単位：経営体"]
["新旧市区町村",{"$nulls":4},"法　　　　　人　　　　　化　　　　　し　　　　　て　　　　　い　　　　　る",{"$nulls":8},"地方公共\n団 体 ・\n財 産 区","法人化し\nていない"]
[{"$nulls":5},"小　　計","農事組合\n法　　人","会　　社",null,null,"各　種　団　体",null,null,"その他の\n法　　人"]
[{"$nulls":4},"計",{"$nulls":3},"合名･合資\n会　　 社",{"$nulls":3},"その他の\n各種団体"]
[{"$nulls":7},"株式会社",null,"合同会社","農　　協","森林組合",{"$nulls":4},"家　　族\n経 営 体"]
[]
[]
[]
["神奈川県",{"$nulls":3},13809,268,12,224,2,1,17,1,2,9,2,13539,13520]
[null,"横浜市",null,"100-00",2205,44,"-",38,"-","-",2,"-","-",4,"-",2161,2160]
[null,"鶴見区",null,"101-00",22,1,"-",1,"-","-","-","-","-","-","-",21,21]
[null,"神奈川区",null,"102-00",130,5,"-",5,"-","-","-","-","-","-","-",125,125]
[null,"西区",null,"103-00","-","-","-","-","-","-","-","-","-","-","-","-","-"]
[null,"中区",null,"104-00",1,"X","X","X","X","X","X","X","X","X","X","X","X"]
[null,"南区(南区２－１)",null,"105-00",4,"X","X","X","X","X","X","X","X","X","X","X","X"]
[null,"保土ケ谷区",null,"106-00",91,2,"-",2,"-","-","-","-","-","-","-",89,89]
[null,null,"保土ケ谷区２－１","106-01",71,1,"-",1,"-","-","-","-","-","-","-",70,70]
[null,null,"二俣川村２－１","106-02",2,"X","X","X","X","X","X","X","X","X","X","X","X"]
[null,null,"新治村２－１","106-03",18,"X","X","X","X","X","X","X","X","X","X","X","X"]
[null,"磯子区",null,"107-00",17,1,"-",1,"-","-","-","-","-","-","-",16,16]
[null,"金沢区",null,"108-00",26,"-","-","-","-","-","-","-","-","-","-",26,26]
[null,"港北区",null,"109-00",233,2,"-",1,"-","-","-","-","-",1,"-",231,231]
[null,null,"港北","109-01",91,1,"-",1,"-","-","-","-","-","-","-",90,90]
[null,null,"新田村２－１","109-02",142,1,"-","-","-","-","-","-","-",1,"-",141,141]
[null,"戸塚区",null,"110-00",211,7,"-",7,"-","-","-","-","-","-","-",204,204]
[null,null,"戸塚町","110-01",20,1,"-",1,"-","-","-","-","-","-","-",19,19]
[null,null,"豊田村２－１","110-02",4,1,"-",1,"-","-","-","-","-","-","-",3,3]
[null,null,"川上村","110-03",42,"-","-","-","-","-","-","-","-","-","-",42,42]
[null,null,"大正村２－１","110-04",121,5,"-",5,"-","-","-","-","-","-","-",116,116]
[null,null,"中川村３－１","110-05",24,"-","-","-","-","-","-","-","-","-","-",24,24]
[null,"港南区(南区２－２)",null,"111-00",49,1,"-",1,"-","-","-","-","-","-","-",48,48]
[null,"旭区",null,"112-00",166,4,"-",3,"-","-","-","-","-",1,"-",162,162]
[null,null,"保土ケ谷区２－２","112-01",11,"-","-","-","-","-","-","-","-","-","-",11,11]
[null,null,"二俣川村２－２","112-02",73,1,"-",1,"-","-","-","-","-","-","-",72,72]
[null,null,"都岡村","112-03",82,3,"-",2,"-","-","-","-","-",1,"-",79,79]
[null,"緑区",null,"113-00",237,4,"-",3,"-","-","-","-","-",1,"-",233,233]
{"$rows_left_out":226}
{"sheet":"2020旧市町村","index":3,"n_rows":256,"n_cols":24,"rows_kept":256,"hidden":true,"merged":[[3,0,4,7],[3,8,7,8],[3,9,3,20],[3,21,7,21],[3,22,7,22],[4,9,7,9],[4,10,7,10],[4,11,4,15],[4,16,4,19],[4,20,7,20],[4,23,7,23],[5,0,5,3],[5,4,5,7],[5,11,7,11],[5,12,7,12],[5,13,7,13],[5,14,7,14],[5,15,7,15],[5,16,7,16],[5,17,7,17],[5,18,7,18],[5,19,7,19],[6,0,7,0],[6,1,7,1],[6,2,7,2],[6,3,7,3],[6,4,7,4],[6,5,7,5],[6,6,7,6],[6,7,7,7]]}
["Ⅱ　農業経営体（総数）"]
["２　組織形態別経営体数"]
[{"$nulls":23},"単位：経営体"]
["新旧市区町村",{"$nulls":7},"合計","法人化している",{"$nulls":11},"地方公共団\n体・財産区","法人化し\nていない"]
[{"$nulls":9},"計","農事組合\n法人","会社",{"$nulls":4},"各種団体",{"$nulls":3},"その他の\n法人",null,null,"個人経営体"]
["コード",{"$nulls":3},"名称",{"$nulls":6},"小計","株式会社","合名・合資\n会社","合同会社","相互会社","小計","農協","森林組合","その他の\n各種団体"]
["都道府県","振興局","市区町村","旧市区町村","都道府県","振興局","市区町村","旧市区町村"]
[]
[]
["14","00","000","00","神奈川県",{"$nulls":3},11402,294,17,246,238,1,7,"-",13,12,"-",1,18,1,11107,11091]
["14","00","100","00","神奈川県",null,"横浜市",null,1931,48,2,42,40,"-",2,"-","-","-","-","-",4,"-",1883,1879]
["14","00","101","00","神奈川県",null,"鶴見区",null,17,1,"-",1,1,"-","-","-","-","-","-","-","-","-",16,16]
["14","00","102","00","神奈川県",null,"神奈川区",null,122,4,"-",4,3,"-",1,"-","-","-","-","-","-","-",118,118]
["14","00","103","00","神奈川県",null,"西区",null,1,1,"x","x","x","x","x","x","x","x","x","x","x","x","x","-"]
["14","00","104","00","神奈川県",null,"中区",null,"-","-","-","-","-","-","-","-","-","-","-","-","-","-","-","-"]
["14","00","105","00","神奈川県",null,"南区（南区２－１）",null,7,"-","x","x","x","x","x","x","x","x","x","x","x","x","x",7]
["14","00","106","00","神奈川県",null,"保土ケ谷区",null,84,4,"-",4,4,"-","-","-","-","-","-","-","-","-",80,80]
["14","00","106","01","神奈川県",null,"保土ケ谷区","保土ケ谷区２－１",64,3,"-",3,3,"-","-","-","-","-","-","-","-","-",61,61]
["14","00","106","02","神奈川県",null,"保土ケ谷区","二俣川村２－１",2,"-","x","x","x","x","x","x","x","x","x","x","x","x","x",2]
["14","00","106","03","神奈川県",null,"保土ケ谷区","新治村２－１",18,1,"x","x","x","x","x","x","x","x","x","x","x","x","x",17]
["14","00","107","00","神奈川県",null,"磯子区",null,18,1,"-",1,1,"-","-","-","-","-","-","-","-","-",17,17]
["14","00","108","00","神奈川県",null,"金沢区",null,26,1,"-",1,1,"-","-","-","-","-","-","-","-","-",25,25]
["14","00","109","00","神奈川県",null,"港北区",null,215,5,"-",4,4,"-","-","-","-","-","-","-",1,"-",210,210]
["14","00","109","01","神奈川県",null,"港北区","港北",86,2,"-",1,1,"-","-","-","-","-","-","-",1,"-",84,84]
["14","00","109","02","神奈川県",null,"港北区","新田村２－１",129,3,"-",3,3,"-","-","-","-","-","-","-","-","-",126,126]
["14","00","110","00","神奈川県",null,"戸塚区",null,175,7,"-",6,6,"-","-","-","-","-","-","-",1,"-",168,168]
["14","00","110","01","神奈川県",null,"戸塚区","戸塚町",15,"-","-","-","-","-","-","-","-","-","-","-","-","-",15,15]
["14","00","110","02","神奈川県",null,"戸塚区","豊田村２－１",4,1,"-",1,1,"-","-","-","-","-","-","-","-","-",3,3]
["14","00","110","03","神奈川県",null,"戸塚区","川上村",35,3,"-",3,3,"-","-","-","-","-","-","-","-","-",32,32]
["14","00","110","04","神奈川県",null,"戸塚区","大正村２－１",101,3,"-",2,2,"-","-","-","-","-","-","-",1,"-",98,98]
["14","00","110","05","神奈川県",null,"戸塚区","中川村３－１",20,"-","-","-","-","-","-","-","-","-","-","-","-","-",20,20]
["14","00","111","00","神奈川県",null,"港南区（南区２－２）",null,43,"-","-","-","-","-","-","-","-","-","-","-","-","-",43,42]
["14","00","112","00","神奈川県",null,"旭区",null,116,1,"-",1,1,"-","-","-","-","-","-","-","-","-",115,115]
["14","00","112","01","神奈川県",null,"旭区","保土ケ谷区２－２",10,"-","-","-","-","-","-","-","-","-","-","-","-","-",10,10]
["14","00","112","02","神奈川県",null,"旭区","二俣川村２－２",42,"-","-","-","-","-","-","-","-","-","-","-","-","-",42,42]
["14","00","112","03","神奈川県",null,"旭区","都岡村",64,1,"-",1,1,"-","-","-","-","-","-","-","-","-",63,63]
["14","00","113","00","神奈川県",null,"緑区",null,214,3,"-",3,3,"-","-","-","-","-","-","-","-","-",211,211]
["14","00","113","01","神奈川県",null,"緑区","中里村２－１",65,2,"-",2,2,"-","-","-","-","-","-","-","-","-",63,63]
["14","00","113","02","神奈川県",null,"緑区","田奈村２－１",67,1,"-",1,1,"-","-","-","-","-","-","-","-","-",66,66]
["14","00","113","03","神奈川県",null,"緑区","新治村２－２",82,"-","-","-","-","-","-","-","-","-","-","-","-","-",82,82]
{"$rows_left_out":217}
{"sheet":"2005_2020市町","index":4,"n_rows":71,"n_cols":6,"rows_kept":71,"hidden":true}
[null,null,"2005年","2010年","2015年","2020年"]
["神奈川県",null,{"$f":"'2005旧市町'!E13","v":{"v":17121,"d":"17,121 "}},{"$f":"'2010旧市町村'!E13","v":{"v":15612,"d":"15,612 "}},{"$f":"'2015旧市町村'!E13","v":{"v":13809,"d":"13,809 "}},{"$f":"'2020旧市町村'!I10","v":{"v":11402,"d":"11,402 "}}]
["横浜市",null,{"$f":"'2005旧市町'!E14","v":{"v":2726,"d":"2,726 "}},{"$f":"'2010旧市町村'!E14","v":{"v":2531,"d":"2,531 "}},{"$f":"'2015旧市町村'!E14","v":{"v":2205,"d":"2,205 "}},{"$f":"'2020旧市町村'!I11","v":{"v":1931,"d":"1,931 "}}]
["鶴見区",null,{"$f":"'2005旧市町'!E15","v":{"v":32,"d":"32 "}},{"$f":"'2010旧市町村'!E15","v":{"v":25,"d":"25 "}},{"$f":"'2015旧市町村'!E15","v":{"v":22,"d":"22 "}},{"$f":"'2020旧市町村'!I12","v":{"v":17,"d":"17 "}}]
["神奈川区",null,{"$f":"'2005旧市町'!E16","v":{"v":159,"d":"159 "}},{"$f":"'2010旧市町村'!E16","v":{"v":152,"d":"152 "}},{"$f":"'2015旧市町村'!E16","v":{"v":130,"d":"130 "}},{"$f":"'2020旧市町村'!I13","v":{"v":122,"d":"122 "}}]
["西区",null,{"$f":"'2005旧市町'!E17","v":"-"},{"$f":"'2010旧市町村'!E17","v":"-"},{"$f":"'2015旧市町村'!E17","v":"-"},{"$f":"'2020旧市町村'!I14","v":{"v":1,"d":"1 "}}]
["中区",null,{"$f":"'2005旧市町'!E18","v":{"v":4,"d":"4 "}},{"$f":"'2010旧市町村'!E18","v":{"v":1,"d":"1 "}},{"$f":"'2015旧市町村'!E18","v":{"v":1,"d":"1 "}},{"$f":"'2020旧市町村'!I15","v":"-"}]
["南区（南区２－１）",null,{"$f":"'2005旧市町'!E19","v":{"v":3,"d":"3 "}},{"$f":"'2010旧市町村'!E19","v":{"v":3,"d":"3 "}},{"$f":"'2015旧市町村'!E19","v":{"v":4,"d":"4 "}},{"$f":"'2020旧市町村'!I16","v":{"v":7,"d":"7 "}}]
["保土ケ谷区",null,{"$f":"'2005旧市町'!E20","v":{"v":103,"d":"103 "}},{"$f":"'2010旧市町村'!E20","v":{"v":100,"d":"100 "}},{"$f":"'2015旧市町村'!E20","v":{"v":91,"d":"91 "}},{"$f":"'2020旧市町村'!I17","v":{"v":84,"d":"84 "}}]
["磯子区",null,{"$f":"'2005旧市町'!E24","v":{"v":29,"d":"29 "}},{"$f":"'2010旧市町村'!E24","v":{"v":25,"d":"25 "}},{"$f":"'2015旧市町村'!E24","v":{"v":17,"d":"17 "}},{"$f":"'2020旧市町村'!I21","v":{"v":18,"d":"18 "}}]
["金沢区",null,{"$f":"'2005旧市町'!E25","v":{"v":28,"d":"28 "}},{"$f":"'2010旧市町村'!E25","v":{"v":31,"d":"31 "}},{"$f":"'2015旧市町村'!E25","v":{"v":26,"d":"26 "}},{"$f":"'2020旧市町村'!I22","v":{"v":26,"d":"26 "}}]
["港北区",null,{"$f":"'2005旧市町'!E26","v":{"v":286,"d":"286 "}},{"$f":"'2010旧市町村'!E26","v":{"v":264,"d":"264 "}},{"$f":"'2015旧市町村'!E26","v":{"v":233,"d":"233 "}},{"$f":"'2020旧市町村'!I23","v":{"v":215,"d":"215 "}}]
["戸塚区",null,{"$f":"'2005旧市町'!E29","v":{"v":254,"d":"254 "}},{"$f":"'2010旧市町村'!E29","v":{"v":243,"d":"243 "}},{"$f":"'2015旧市町村'!E29","v":{"v":211,"d":"211 "}},{"$f":"'2020旧市町村'!I26","v":{"v":175,"d":"175 "}}]
["港南区（南区２－２）",null,{"$f":"'2005旧市町'!E35","v":{"v":53,"d":"53 "}},{"$f":"'2010旧市町村'!E35","v":{"v":52,"d":"52 "}},{"$f":"'2015旧市町村'!E35","v":{"v":49,"d":"49 "}},{"$f":"'2020旧市町村'!I32","v":{"v":43,"d":"43 "}}]
["旭区",null,{"$f":"'2005旧市町'!E36","v":{"v":200,"d":"200 "}},{"$f":"'2010旧市町村'!E36","v":{"v":173,"d":"173 "}},{"$f":"'2015旧市町村'!E36","v":{"v":166,"d":"166 "}},{"$f":"'2020旧市町村'!I33","v":{"v":116,"d":"116 "}}]
["緑区",null,{"$f":"'2005旧市町'!E40","v":{"v":286,"d":"286 "}},{"$f":"'2010旧市町村'!E40","v":{"v":264,"d":"264 "}},{"$f":"'2015旧市町村'!E40","v":{"v":237,"d":"237 "}},{"$f":"'2020旧市町村'!I37","v":{"v":214,"d":"214 "}}]
["瀬谷区",null,{"$f":"'2005旧市町'!E44","v":{"v":194,"d":"194 "}},{"$f":"'2010旧市町村'!E44","v":{"v":193,"d":"193 "}},{"$f":"'2015旧市町村'!E44","v":{"v":162,"d":"162 "}},{"$f":"'2020旧市町村'!I41","v":{"v":154,"d":"154 "}}]
["栄区",null,{"$f":"'2005旧市町'!E47","v":{"v":79,"d":"79 "}},{"$f":"'2010旧市町村'!E47","v":{"v":67,"d":"67 "}},{"$f":"'2015旧市町村'!E47","v":{"v":52,"d":"52 "}},{"$f":"'2020旧市町村'!I44","v":{"v":49,"d":"49 "}}]
["泉区",null,{"$f":"'2005旧市町'!E50","v":{"v":339,"d":"339 "}},{"$f":"'2010旧市町村'!E50","v":{"v":325,"d":"325 "}},{"$f":"'2015旧市町村'!E50","v":{"v":274,"d":"274 "}},{"$f":"'2020旧市町村'!I47","v":{"v":247,"d":"247 "}}]
["青葉区",null,{"$f":"'2005旧市町'!E54","v":{"v":295,"d":"295 "}},{"$f":"'2010旧市町村'!E54","v":{"v":256,"d":"256 "}},{"$f":"'2015旧市町村'!E54","v":{"v":215,"d":"215 "}},{"$f":"'2020旧市町村'!I51","v":{"v":178,"d":"178 "}}]
["都筑区",null,{"$f":"'2005旧市町'!E60","v":{"v":382,"d":"382 "}},{"$f":"'2010旧市町村'!E60","v":{"v":357,"d":"357 "}},{"$f":"'2015旧市町村'!E60","v":{"v":315,"d":"315 "}},{"$f":"'2020旧市町村'!I57","v":{"v":265,"d":"265 "}}]
["川崎市",null,{"$f":"'2005旧市町'!E65","v":{"v":821,"d":"821 "}},{"$f":"'2010旧市町村'!E65","v":{"v":778,"d":"778 "}},{"$f":"'2015旧市町村'!E65","v":{"v":672,"d":"672 "}},{"$f":"'2020旧市町村'!I62","v":{"v":590,"d":"590 "}}]
["川崎区",null,{"$f":"'2005旧市町'!E66","v":"-"},{"$f":"'2010旧市町村'!E66","v":"-"},{"$f":"'2015旧市町村'!E66","v":"-"},{"$f":"'2020旧市町村'!I63","v":"-"}]
["幸区",null,{"$f":"'2005旧市町'!E67","v":{"v":3,"d":"3 "}},{"$f":"'2010旧市町村'!E67","v":{"v":4,"d":"4 "}},{"$f":"'2015旧市町村'!E67","v":{"v":5,"d":"5 "}},{"$f":"'2020旧市町村'!I64","v":{"v":5,"d":"5 "}}]
["中原区",null,{"$f":"'2005旧市町'!E68","v":{"v":60,"d":"60 "}},{"$f":"'2010旧市町村'!E68","v":{"v":53,"d":"53 "}},{"$f":"'2015旧市町村'!E68","v":{"v":47,"d":"47 "}},{"$f":"'2020旧市町村'!I65","v":{"v":40,"d":"40 "}}]
["高津区",null,{"$f":"'2005旧市町'!E69","v":{"v":137,"d":"137 "}},{"$f":"'2010旧市町村'!E69","v":{"v":131,"d":"131 "}},{"$f":"'2015旧市町村'!E69","v":{"v":115,"d":"115 "}},{"$f":"'2020旧市町村'!I66","v":{"v":102,"d":"102 "}}]
["多摩区",null,{"$f":"'2005旧市町'!E74","v":{"v":194,"d":"194 "}},{"$f":"'2010旧市町村'!E74","v":{"v":176,"d":"176 "}},{"$f":"'2015旧市町村'!E74","v":{"v":154,"d":"154 "}},{"$f":"'2020旧市町村'!I71","v":{"v":135,"d":"135 "}}]
["宮前区",null,{"$f":"'2005旧市町'!E78","v":{"v":225,"d":"225 "}},{"$f":"'2010旧市町村'!E78","v":{"v":217,"d":"217 "}},{"$f":"'2015旧市町村'!E78","v":{"v":184,"d":"184 "}},{"$f":"'2020旧市町村'!I75","v":{"v":160,"d":"160 "}}]
["麻生区",null,{"$f":"'2005旧市町'!E81","v":{"v":202,"d":"202 "}},{"$f":"'2010旧市町村'!E81","v":{"v":197,"d":"197 "}},{"$f":"'2015旧市町村'!E81","v":{"v":167,"d":"167 "}},{"$f":"'2020旧市町村'!I78","v":{"v":148,"d":"148 "}}]
["相模原市",null,{"$f":"'2005旧市町'!E141+C68+C69+C70+C71","v":{"v":1112,"d":"1,112 "}},{"$f":"'2010旧市町村'!E141","v":{"v":854,"d":"854 "}},{"$f":"'2015旧市町村'!E84","v":{"v":653,"d":"653 "}},{"$f":"'2020旧市町村'!I81","v":{"v":488,"d":"488 "}}]
["緑区",{"$nulls":3},{"$f":"'2015旧市町村'!E85","v":{"v":295,"d":"295 "}},{"$f":"'2020旧市町村'!I82","v":{"v":223,"d":"223 "}}]
["中央区",{"$nulls":3},{"$f":"'2015旧市町村'!E109","v":{"v":142,"d":"142 "}},{"$f":"'2020旧市町村'!I106","v":{"v":101,"d":"101 "}}]
["南区",{"$nulls":3},{"$f":"'2015旧市町村'!E116","v":{"v":216,"d":"216 "}},{"$f":"'2020旧市町村'!I113","v":{"v":164,"d":"164 "}}]
["横須賀市",null,{"$f":"'2005旧市町'!E84","v":{"v":428,"d":"428 "}},{"$f":"'2010旧市町村'!E84","v":{"v":392,"d":"392 "}},{"$f":"'2015旧市町村'!E123","v":{"v":374,"d":"374 "}},{"$f":"'2020旧市町村'!I120","v":{"v":333,"d":"333 "}}]
["平塚市",null,{"$f":"'2005旧市町'!E94","v":{"v":1324,"d":"1,324 "}},{"$f":"'2010旧市町村'!E94","v":{"v":1230,"d":"1,230 "}},{"$f":"'2015旧市町村'!E133","v":{"v":1115,"d":"1,115 "}},{"$f":"'2020旧市町村'!I130","v":{"v":845,"d":"845 "}}]
["鎌倉市",null,{"$f":"'2005旧市町'!E106","v":{"v":96,"d":"96 "}},{"$f":"'2010旧市町村'!E106","v":{"v":84,"d":"84 "}},{"$f":"'2015旧市町村'!E145","v":{"v":72,"d":"72 "}},{"$f":"'2020旧市町村'!I142","v":{"v":66,"d":"66 "}}]
["藤沢市",null,{"$f":"'2005旧市町'!E110","v":{"v":848,"d":"848 "}},{"$f":"'2010旧市町村'!E110","v":{"v":739,"d":"739 "}},{"$f":"'2015旧市町村'!E149","v":{"v":718,"d":"718 "}},{"$f":"'2020旧市町村'!I146","v":{"v":604,"d":"604 "}}]
["小田原市",null,{"$f":"'2005旧市町'!E118","v":{"v":1583,"d":"1,583 "}},{"$f":"'2010旧市町村'!E118","v":{"v":1423,"d":"1,423 "}},{"$f":"'2015旧市町村'!E157","v":{"v":1271,"d":"1,271 "}},{"$f":"'2020旧市町村'!I154","v":{"v":991,"d":"991 "}}]
["茅ヶ崎市",null,{"$f":"'2005旧市町'!E135","v":{"v":466,"d":"466 "}},{"$f":"'2010旧市町村'!E135","v":{"v":402,"d":"402 "}},{"$f":"'2015旧市町村'!E174","v":{"v":350,"d":"350 "}},{"$f":"'2020旧市町村'!I171","v":{"v":313,"d":"313 "}}]
["逗子市",null,{"$f":"'2005旧市町'!E140","v":{"v":4,"d":"4 "}},{"$f":"'2010旧市町村'!E140","v":{"v":2,"d":"2 "}},{"$f":"'2015旧市町村'!E179","v":{"v":2,"d":"2 "}},{"$f":"'2020旧市町村'!I176","v":{"v":2,"d":"2 "}}]
{"$rows_left_out":32}
{"sheet":"グラフ","index":5,"n_rows":27,"n_cols":19,"rows_kept":27}
[]
[]
[{"$nulls":4},"↓こちらのタブからご覧になりたい（県）市区町村を選択してください。"]
[null,"（経営体）",null,null,"神奈川県",{"$nulls":9},"全国・神奈川県"]
[{"$nulls":11},{"$f":"B4","v":"（経営体）"}]
{"$rows_empty":17}
[{"$nulls":7},"（経営体）",{"$nulls":9},"（経営体）"]
[null,null,"センサス",{"$f":"'2005_2020市町'!C1","v":"2005年"},{"$f":"'2005_2020市町'!D1","v":"2010年"},{"$f":"'2005_2020市町'!E1","v":"2015年"},{"$f":"'2005_2020市町'!F1","v":"2020年"},"15年差","増減率",{"$nulls":3},"センサス","2005年","2010年","2015年","2020年","15年差","増減率"]
[null,null,"経営体数",{"$f":"_xlfn.XLOOKUP($E$4,'2005_2020市町'!$A$2:$A$63,'2005_2020市町'!C2:C63)","v":{"v":17121,"d":"17,121 "}},{"$f":"_xlfn.XLOOKUP($E$4,'2005_2020市町'!$A$2:$A$63,'2005_2020市町'!D2:D63)","v":{"v":15612,"d":"15,612 "}},{"$f":"_xlfn.XLOOKUP($E$4,'2005_2020市町'!$A$2:$A$63,'2005_2020市町'!E2:E63)","v":{"v":13809,"d":"13,809 "}},{"$f":"_xlfn.XLOOKUP($E$4,'2005_2020市町'!$A$2:$A$63,'2005_2020市町'!F2:F63)","v":{"v":11402,"d":"11,402 "}},{"$f":"G25-D25","v":{"v":-5719,"d":"(5,719)"}},{"$f":"(G25-D25)/D25","v":{"v":-0.33403422697272356,"d":"-33%"}},{"$nulls":3},"全国",{"v":2009380,"d":"2,009,380 "},{"v":1679084,"d":"1,679,084 "},{"v":1377266,"d":"1,377,266 "},{"v":1075705,"d":"1,075,705 "},{"$f":"Q25-N25","v":{"v":-933675,"d":"(933,675)"}},{"$f":"(Q25-N25)/N25","v":{"v":-0.46465825279439427,"d":"-46%"}}]
[null,null,"増減率","-",{"$f":"(E25-D25)/D25","v":{"v":-0.08813737515332049,"d":"-9%"}},{"$f":"(F25-E25)/E25","v":{"v":-0.1154880860876249,"d":"-12%"}},{"$f":"(G25-F25)/F25","v":{"v":-0.1743066116300963,"d":"-17%"}},"-","-",{"$nulls":3},"神奈川県",{"v":17121,"d":"17,121 "},{"v":15612,"d":"15,612 "},{"v":13809,"d":"13,809 "},{"v":11402,"d":"11,402 "},{"$f":"Q26-N26","v":{"v":-5719,"d":"(5,719)"}},{"$f":"(Q26-N26)/N26","v":{"v":-0.33403422697272356,"d":"-33%"}}]
[{"$nulls":17},"出典：農林業センサス"]