{"text_format":"3","workbook":"xlsx","n_sheets":27,"sheets":["16","17","18","19","20","21","22","23","24","25","26","27","28","29","30","R1","R2","R3","R4","R5","R6","合併","データ田","グラフ田 ","データ畑","グラフ畑","グラフ"],"not_rendered":{"charts":4,"defined_names":43},"read":"whole","date_system":"1900"}

{"sheet":"16","index":0,"n_rows":48,"n_cols":12,"rows_kept":48,"hidden":true}
["農林水産関係市町村別データ"]
["平成16年"]
["耕地面積"]
["神奈川県"]
["都道","市町",null,"耕地面積","田耕地面積","田本地面積","畑耕地面積","普通畑","樹園地","牧草地","田畑計の作","田畑計の耕"]
["府県","村　","市町村名",null,"　　　　　","　　　　　","　　　　　",{"$nulls":3},"付延べ面積","地利用率"]
["ｺｰﾄﾞ","ｺｰﾄﾞ"]
[{"$nulls":3},"ha","ha","ha","ha","ha","ha","ha","ha","0.0%"]
[14,100,"横浜市",{"v":3120,"d":"3,120"},209,199,{"v":2910,"d":"2,910"},{"v":2560,"d":"2,560"},356,"-",{"v":3420,"d":"3,420"},109.6]
[14,130,"川崎市",646,31,29,615,458,157,"-",695,107.6]
{"$rows_left_out":39}
{"sheet":"17","index":1,"n_rows":46,"n_cols":12,"rows_kept":46,"hidden":true}
["農林水産関係市町村別データ"]
["平成17年"]
["耕地面積"]
["神奈川県"]
["都道","市町",null,"耕地面積","田耕地面積","田本地面積","畑耕地面積","普通畑","樹園地","牧草地","田畑計の作","田畑計の耕"]
["府県","村　","市町村名",null,"　　　　　","　　　　　","　　　　　",{"$nulls":3},"付延べ面積","地利用率"]
["ｺｰﾄﾞ","ｺｰﾄﾞ"]
[{"$nulls":3},"ha","ha","ha","ha","ha","ha","ha","ha","0.0%"]
[14,100,"横浜市",{"v":3120,"d":"3,120"},208,198,{"v":2910,"d":"2,910"},{"v":2560,"d":"2,560"},352,"-",{"v":3360,"d":"3,360"},107.7]
[14,130,"川崎市",644,30,28,614,459,155,"-",683,106.1]
{"$rows_left_out":37}
{"sheet":"18","index":2,"n_rows":45,"n_cols":12,"rows_kept":45,"hidden":true}
["農林水産関係市町村別データ"]
["平成18年"]
["耕地面積"]
["神奈川県"]
["都道","市町",null,"耕地面積","田耕地面積","田本地面積","畑耕地面積","普通畑","樹園地","牧草地","田畑計の作","田畑計の耕"]
["府県","村　","市町村名",null,"　　　　　","　　　　　","　　　　　",{"$nulls":3},"付延べ面積","地利用率"]
["ｺｰﾄﾞ","ｺｰﾄﾞ"]
[{"$nulls":3},"ha","ha","ha","ha","ha","ha","ha","ha","0.0%"]
[14,100,"横浜市",{"v":3090,"d":"3,090"},198,188,{"v":2890,"d":"2,890"},{"v":2550,"d":"2,550"},346,"-",{"v":3290,"d":"3,290"},106.5]
[14,130,"川崎市",637,28,27,609,459,150,"-",668,104.9]
{"$rows_left_out":36}
{"sheet":"19","index":3,"n_rows":49,"n_cols":7,"rows_kept":49,"hidden":true}
["農林水産関係市町村別データ"]
["平成19年"]
["耕地面積"]
["神奈川県"]
["都道","市町",null,"耕地面積","田耕地面積","田本地面積","畑耕地面積"]
["府県","村　","市町村名",null,"　　　　　","　　　　　","　　　　　"]
["ｺｰﾄﾞ","ｺｰﾄﾞ"]
[{"$nulls":3},"ha","ha","ha","ha"]
[14,100,"横浜市",{"v":3060,"d":"3,060"},190,181,{"v":2870,"d":"2,870"}]
[14,130,"川崎市",626,28,26,598]
{"$rows_left_out":40}
{"sheet":"20","index":4,"n_rows":49,"n_cols":7,"rows_kept":49,"hidden":true}
["農林水産関係市町村別データ"]
["平成20年"]
["耕地面積"]
["神奈川県"]
["都道","市町",null,"耕地面積","田耕地面積",null,"畑耕地面積"]
["府県","村　","市町村名",null,"　　　　　","田本地面積","　　　　　"]
["ｺｰﾄﾞ","ｺｰﾄﾞ"]
[{"$nulls":3},"ha","ha","ha","ha"]
[14,100,"横浜市",{"v":3010,"d":"3,010"},180,171,{"v":2830,"d":"2,830"}]
[14,130,"川崎市",620,27,25,593]
{"$rows_left_out":40}
{"sheet":"21","index":5,"n_rows":49,"n_cols":7,"rows_kept":49,"hidden":true}
["農林水産関係市町村別データ"]
["平成21年"]
["耕地面積"]
["神奈川県"]
["都道","市町",null,"耕地面積","田耕地面積",null,"畑耕地面積"]
["府県","村　","市町村名",null,"　　　　　","田本地面積","　　　　　"]
["ｺｰﾄﾞ","ｺｰﾄﾞ"]
[{"$nulls":3},"ha","ha","ha","ha"]
[14,100,"横浜市",{"v":2990,"d":"2,990"},178,169,{"v":2810,"d":"2,810"}]
[14,130,"川崎市",613,27,25,586]
{"$rows_left_out":40}
{"sheet":"22","index":6,"n_rows":49,"n_cols":7,"rows_kept":49,"hidden":true}
["農林水産関係市町村別統計"]
["平成22年"]
["耕地面積"]
["神奈川県"]
["都道","市町",null,"耕地面積","田耕地面積",null,"畑耕地面積"]
["府県","村　","市町村名",null,"　　　　　","田本地面積","　　　　　"]
["ｺｰﾄﾞ","ｺｰﾄﾞ"]
[{"$nulls":3},"ha","ha","ha","ha"]
[14,100,"横浜市",{"v":2970,"d":"2,970"},176,169,{"v":2800,"d":"2,800"}]
[14,130,"川崎市",608,24,23,584]
{"$rows_left_out":40}
{"sheet":"23","index":7,"n_rows":51,"n_cols":7,"rows_kept":51,"hidden":true}
["農林水産関係市町村別統計"]
["平成23年"]
["耕地面積"]
["神奈川県"]
["都道","市町",null,"耕地面積","田耕地面積",null,"畑耕地面積"]
["府県","村　","市町村名",null,"　　　　　","田本地面積","　　　　　"]
["ｺｰﾄﾞ","ｺｰﾄﾞ"]
[{"$nulls":3},"ha","ha","ha","ha"]
[14,100,"横浜市",{"v":2960,"d":"2,960"},172,165,{"v":2790,"d":"2,790"}]
[14,130,"川崎市",605,24,23,581]
{"$rows_left_out":42}
{"sheet":"24","index":8,"n_rows":51,"n_cols":7,"rows_kept":51,"hidden":true}
["農林水産関係市町村別統計"]
["平成24年"]
["耕地面積"]
["神奈川県"]
["都道","市町",null,"耕地面積","田耕地面積",null,"畑耕地面積"]
["府県","村　","市町村名",null,"　　　　　","田本地面積","　　　　　"]
["ｺｰﾄﾞ","ｺｰﾄﾞ"]
[{"$nulls":3},"ha","ha","ha","ha"]
[14,100,"横浜市",{"v":2950,"d":"2,950"},168,162,{"v":2790,"d":"2,790"}]
[14,130,"川崎市",603,23,22,580]
{"$rows_left_out":42}
{"sheet":"25","index":9,"n_rows":51,"n_cols":7,"rows_kept":51,"hidden":true}
["農林水産関係市町村別統計"]
["平成25年"]
["耕地面積"]
["神奈川県"]
["都道","市町",null,"耕地面積","田耕地面積",null,"畑耕地面積"]
["府県","村　","市町村名",null,"　　　　　","田本地面積","　　　　　"]
["ｺｰﾄﾞ","ｺｰﾄﾞ"]
[{"$nulls":3},"ha","ha","ha","ha"]
[14,100,"横浜市",{"v":2930,"d":"2,930"},163,157,{"v":2770,"d":"2,770"}]
[14,130,"川崎市",598,22,21,576]
{"$rows_left_out":42}
{"sheet":"26","index":10,"n_rows":51,"n_cols":7,"rows_kept":51,"hidden":true}
["農林水産関係市町村別統計"]
["平成26年"]
["耕地面積"]
["神奈川県"]
["都道","市町",null,"耕地面積","田耕地面積",null,"畑耕地面積"]
["府県","村　","市町村名",null,"　　　　　","田本地面積","　　　　　"]
["ｺｰﾄﾞ","ｺｰﾄﾞ"]
[{"$nulls":3},"ha","ha","ha","ha"]
[14,100,"横浜市",{"v":2870,"d":"2,870"},160,154,{"v":2710,"d":"2,710"}]
[14,130,"川崎市",573,22,21,551]
{"$rows_left_out":42}
{"sheet":"27","index":11,"n_rows":51,"n_cols":7,"rows_kept":51,"hidden":true}
["農林水産関係市町村別統計"]
["平成27年"]
["耕地面積"]
["神奈川県"]
["都道","市町",null,"耕地面積","田耕地面積",null,"畑耕地面積"]
["府県","村　","市町村名",null,"　　　　　","田本地面積","　　　　　"]
["ｺｰﾄﾞ","ｺｰﾄﾞ"]
[{"$nulls":3},"ha","ha","ha","ha"]
[14,100,"横浜市",{"v":2850,"d":"2,850"},155,149,{"v":2690,"d":"2,690"}]
[14,130,"川崎市",571,21,20,550]
{"$rows_left_out":42}
{"sheet":"28","index":12,"n_rows":51,"n_cols":7,"rows_kept":51,"hidden":true}
["農林水産関係市町村別統計"]
["平成28年"]
["耕地面積"]
["神奈川県"]
["都道","市町",null,"耕地面積","田耕地面積",null,"畑耕地面積"]
["府県","村　","市町村名",null,"　　　　　","田本地面積","　　　　　"]
["ｺｰﾄﾞ","ｺｰﾄﾞ"]
[{"$nulls":3},"ha","ha","ha","ha"]
[14,100,"横浜市",{"v":2820,"d":"2,820"},149,143,{"v":2680,"d":"2,680"}]
[14,130,"川崎市",570,21,20,549]
{"$rows_left_out":42}
{"sheet":"29","index":13,"n_rows":51,"n_cols":7,"rows_kept":51,"hidden":true}
["農林水産関係市町村別統計"]
["平成29年"]
["耕地面積"]
["神奈川県"]
["都道","市町",null,"耕地面積","田耕地面積",null,"畑耕地面積"]
["府県","村　","市町村名",null,"　　　　　","田本地面積","　　　　　"]
["ｺｰﾄﾞ","ｺｰﾄﾞ"]
[{"$nulls":3},"ha","ha","ha","ha"]
[14,100,"横浜市",{"v":2800,"d":"2,800"},146,141,{"v":2660,"d":"2,660"}]
[14,130,"川崎市",570,21,20,549]
{"$rows_left_out":42}
{"sheet":"30","index":14,"n_rows":51,"n_cols":7,"rows_kept":51,"hidden":true}
["農林水産関係市町村別統計"]
["平成30年"]
["耕地面積"]
["神奈川県"]
["都道","市町",null,"耕地面積","田耕地面積",null,"畑耕地面積"]
["府県","村　","市町村名",null,"　　　　　","田本地面積","　　　　　"]
["ｺｰﾄﾞ","ｺｰﾄﾞ"]
[{"$nulls":3},"ha","ha","ha","ha"]
[14,100,"横浜市",{"v":2780,"d":"2,780"},142,137,{"v":2630,"d":"2,630"}]
[14,130,"川崎市",568,21,20,547]
{"$rows_left_out":42}
{"sheet":"R1","index":15,"n_rows":51,"n_cols":7,"rows_kept":51,"hidden":true}
["農林水産関係市町村別統計"]
["令和元年"]
["耕地面積"]
["神奈川県"]
["都道","市町",null,"耕地面積","田耕地面積",null,"畑耕地面積"]
["府県","村　","市町村名",null,"　　　　　","田本地面積","　　　　　"]
["ｺｰﾄﾞ","ｺｰﾄﾞ"]
[{"$nulls":3},"ha","ha","ha","ha"]
[14,100,"横浜市",{"v":2710,"d":"2,710"},139,134,{"v":2570,"d":"2,570"}]
[14,130,"川崎市",547,20,19,527]
{"$rows_left_out":42}
{"sheet":"R2","index":16,"n_rows":51,"n_cols":7,"rows_kept":51,"hidden":true}
["農林水産関係市町村別統計"]
["令和2年"]
["耕地面積"]
["神奈川県"]
["都道","市町",null,"耕地面積","田耕地面積",null,"畑耕地面積"]
["府県","村　","市町村名",null,"　　　　　","田本地面積","　　　　　"]
["ｺｰﾄﾞ","ｺｰﾄﾞ"]
[{"$nulls":3},"ha","ha","ha","ha"]
[14,100,"横浜市",2650,134,129,2520]
[14,130,"川崎市",526,19,18,507]
{"$rows_left_out":42}
{"sheet":"R3","index":17,"n_rows":51,"n_cols":7,"rows_kept":51,"hidden":true}
["農林水産関係市町村別統計"]
["令和3年"]
["耕地面積"]
["神奈川県"]
["都道","市町","市町村名","耕地面積","田耕地面積",null,"畑耕地面積"]
["府県","村　",null,null,"　　　　　","田本地面積","　　　　　"]
["ｺｰﾄﾞ","ｺｰﾄﾞ"]
[{"$nulls":3},"ha","ha","ha","ha"]
[14,100,"横浜市",2620,131,126,2490]
[14,130,"川崎市",511,19,18,492]
{"$rows_left_out":42}
{"sheet":"R4","index":18,"n_rows":51,"n_cols":7,"rows_kept":51,"hidden":true}
["農林水産関係市町村別統計"]
["令和4年"]
["耕地面積"]
["神奈川県"]
["都道","市町","市町村名","耕地面積","田耕地面積",null,"畑耕地面積"]
["府県","村　",null,null,"　　　　　","田本地面積","　　　　　"]
["ｺｰﾄﾞ","ｺｰﾄﾞ"]
[{"$nulls":3},"ha","ha","ha","ha"]
[14,100,"横浜市",2590,131,126,2460]
[14,130,"川崎市",496,19,18,477]
{"$rows_left_out":42}
{"sheet":"R5","index":19,"n_rows":51,"n_cols":7,"rows_kept":51,"hidden":true,"merged":[[4,0,6,0],[4,1,6,1]]}
["農林水産関係市町村別統計"]
["令和5年"]
["耕地面積"]
["神奈川県"]
["都道府県ｺｰﾄﾞ","市町村\nｺｰﾄﾞ","市町村名","耕地面積","田耕地面積",null,"畑耕地面積"]
[{"$nulls":4},"　　　　　","田本地面積","　　　　　"]
[]
[{"$nulls":3},"ha","ha","ha","ha"]
[14,100,"横浜市",2580,131,126,2450]
[14,130,"川崎市",483,18,17,465]
{"$rows_left_out":42}
{"sheet":"R6","index":20,"n_rows":51,"n_cols":7,"rows_kept":51,"hidden":true,"merged":[[4,0,6,0],[4,1,6,1]]}
["農林水産関係市町村別統計"]
["令和6年"]
["耕地面積"]
["神奈川県"]
["都道府県ｺｰﾄﾞ","市町村\nｺｰﾄﾞ","市町村名","耕地面積","田耕地面積",null,"畑耕地面積"]
[{"$nulls":4},"　　　　　","田本地面積","　　　　　"]
[]
[{"$nulls":3},"ha","ha","ha","ha"]
[14,100,"横浜市",2570,131,126,2440]
[14,130,"川崎市",479,18,17,461]
{"$rows_left_out":42}
{"sheet":"合併","index":21,"n_rows":49,"n_cols":25,"rows_kept":49,"hidden":true}
[null,null,2004,2005,2006,2007,2008,2009,2010,2011,2012,2013,2014,2015,2016,2017,2018,2019,2020,2021,2022,2023,2024]
[null,null,"H16","H17","H18","H19","H20","H21","H22","H23","H24","H25","H26","H27","H28","H29","H30","R1","R2","R3","R4","R5","R6"]
[]
[100,"横浜市"]
[130,"川崎市"]
[150,"相模原市",5,3,{"$nulls":20},"H21まで209"]
[201,"横須賀市"]
[203,"平塚市"]
[204,"鎌倉市"]
[205,"藤沢市"]
{"$rows_left_out":33}
{"sheet":"データ田","index":22,"n_rows":45,"n_cols":24,"rows_kept":45,"hidden":true}
[{"$nulls":3},16,17,18,19,20,21,22,23,24,25,26,27,28,29,30,1,2,3,4,5,6]
[{"$nulls":3},2004,2005,2006,2007,2008,2009,2010,2011,2012,2013,2014,2015,2016,2017,2018,2019,2020,2021,2022,2023,2024]
[null,null,"神奈川県",{"$nulls":6},{"v":4030,"d":" 4 030"},3990,3970,3920,3890,3850,3790,3760,3730,3670,3610,3530,3490,3470,3460]
[{"$nulls":3},{"$f":"SUM(D5:D37)","v":{"v":4309,"d":"4,309"}},{"$f":"SUM(E5:E37)","v":4545},4237,4171,4098,4056,4029,3994,3972,3924,3890,3846,3791,3756,3727,3671,3612,3528,3488,3468,3459]
[null,100,"横浜市",209,208,198,190,180,178,176,172,168,163,160,155,149,146,142,139,134,131,131,131,131]
[null,130,"川崎市",31,30,28,28,27,27,24,24,23,22,22,21,21,21,21,20,19,19,19,18,18]
[null,150,"相模原市",{"$f":"SUM(D41:D45)","v":142},{"$f":"SUM(E41:E45)","v":407},141,138,137,137,130,126,125,123,122,122,111,109,108,107,103,102,102,102,102]
[null,201,"横須賀市",19,19,18,17,16,16,12,11,10,10,10,9,9,8,7,7,7,6,6,6,6]
[null,203,"平塚市",777,777,777,777,777,774,772,772,771,766,765,761,739,737,735,732,722,712,711,711,711]
[null,204,"鎌倉市",1,1,1,1,1,1,1,1,1,1,1,1,1,1,1,1,1,1,1,1,1]
{"$rows_left_out":36}
{"sheet":"グラフ田 ","index":23,"n_rows":37,"n_cols":18,"rows_kept":37,"hidden":true}
[{"$nulls":3},{"$f":"データ田!J2","v":2010},{"$f":"データ田!K2","v":2011},{"$f":"データ田!L2","v":2012},{"$f":"データ田!M2","v":2013},{"$f":"データ田!N2","v":2014},{"$f":"データ田!O2","v":2015},{"$f":"データ田!P2","v":2016},{"$f":"データ田!Q2","v":2017},{"$f":"データ田!R2","v":2018},{"$f":"データ田!S2","v":2019},{"$f":"データ田!T2","v":2020},{"$f":"データ田!U2","v":2021},{"$f":"データ田!V2","v":2022},{"$f":"データ田!W2","v":2023},{"$f":"データ田!X2","v":2024}]
[null,100,"横浜市",{"$f":"データ田!J5","v":176},{"$f":"データ田!K5","v":172},{"$f":"データ田!L5","v":168},{"$f":"データ田!M5","v":163},{"$f":"データ田!N5","v":160},{"$f":"データ田!O5","v":155},{"$f":"データ田!P5","v":149},{"$f":"データ田!Q5","v":146},{"$f":"データ田!R5","v":142},{"$f":"データ田!S5","v":139},{"$f":"データ田!T5","v":134},{"$f":"データ田!U5","v":131},{"$f":"データ田!V5","v":131},{"$f":"データ田!W5","v":131},{"$f":"データ田!X5","v":131}]
[null,130,"川崎市",{"$f":"データ田!J6","v":24},{"$f":"データ田!K6","v":24},{"$f":"データ田!L6","v":23},{"$f":"データ田!M6","v":22},{"$f":"データ田!N6","v":22},{"$f":"データ田!O6","v":21},{"$f":"データ田!P6","v":21},{"$f":"データ田!Q6","v":21},{"$f":"データ田!R6","v":21},{"$f":"データ田!S6","v":20},{"$f":"データ田!T6","v":19},{"$f":"データ田!U6","v":19},{"$f":"データ田!V6","v":19},{"$f":"データ田!W6","v":18},{"$f":"データ田!X6","v":18}]
[null,150,"相模原市",{"$f":"データ田!J7","v":130},{"$f":"データ田!K7","v":126},{"$f":"データ田!L7","v":125},{"$f":"データ田!M7","v":123},{"$f":"データ田!N7","v":122},{"$f":"データ田!O7","v":122},{"$f":"データ田!P7","v":111},{"$f":"データ田!Q7","v":109},{"$f":"データ田!R7","v":108},{"$f":"データ田!S7","v":107},{"$f":"データ田!T7","v":103},{"$f":"データ田!U7","v":102},{"$f":"データ田!V7","v":102},{"$f":"データ田!W7","v":102},{"$f":"データ田!X7","v":102}]
[null,201,"横須賀市",{"$f":"データ田!J8","v":12},{"$f":"データ田!K8","v":11},{"$f":"データ田!L8","v":10},{"$f":"データ田!M8","v":10},{"$f":"データ田!N8","v":10},{"$f":"データ田!O8","v":9},{"$f":"データ田!P8","v":9},{"$f":"データ田!Q8","v":8},{"$f":"データ田!R8","v":7},{"$f":"データ田!S8","v":7},{"$f":"データ田!T8","v":7},{"$f":"データ田!U8","v":6},{"$f":"データ田!V8","v":6},{"$f":"データ田!W8","v":6},{"$f":"データ田!X8","v":6}]
[null,203,"平塚市",{"$f":"データ田!J9","v":772},{"$f":"データ田!K9","v":772},{"$f":"データ田!L9","v":771},{"$f":"データ田!M9","v":766},{"$f":"データ田!N9","v":765},{"$f":"データ田!O9","v":761},{"$f":"データ田!P9","v":739},{"$f":"データ田!Q9","v":737},{"$f":"データ田!R9","v":735},{"$f":"データ田!S9","v":732},{"$f":"データ田!T9","v":722},{"$f":"データ田!U9","v":712},{"$f":"データ田!V9","v":711},{"$f":"データ田!W9","v":711},{"$f":"データ田!X9","v":711}]
[null,204,"鎌倉市",{"$f":"データ田!J10","v":1},{"$f":"データ田!K10","v":1},{"$f":"データ田!L10","v":1},{"$f":"データ田!M10","v":1},{"$f":"データ田!N10","v":1},{"$f":"データ田!O10","v":1},{"$f":"データ田!P10","v":1},{"$f":"データ田!Q10","v":1},{"$f":"データ田!R10","v":1},{"$f":"データ田!S10","v":1},{"$f":"データ田!T10","v":1},{"$f":"データ田!U10","v":1},{"$f":"データ田!V10","v":1},{"$f":"データ田!W10","v":1},{"$f":"データ田!X10","v":1}]
[null,205,"藤沢市",{"$f":"データ田!J11","v":142},{"$f":"データ田!K11","v":140},{"$f":"データ田!L11","v":138},{"$f":"データ田!M11","v":137},{"$f":"データ田!N11","v":137},{"$f":"データ田!O11","v":136},{"$f":"データ田!P11","v":135},{"$f":"データ田!Q11","v":134},{"$f":"データ田!R11","v":133},{"$f":"データ田!S11","v":132},{"$f":"データ田!T11","v":130},{"$f":"データ田!U11","v":130},{"$f":"データ田!V11","v":129},{"$f":"データ田!W11","v":129},{"$f":"データ田!X11","v":128}]
[null,206,"小田原市",{"$f":"データ田!J12","v":545},{"$f":"データ田!K12","v":537},{"$f":"データ田!L12","v":536},{"$f":"データ田!M12","v":534},{"$f":"データ田!N12","v":527},{"$f":"データ田!O12","v":521},{"$f":"データ田!P12","v":521},{"$f":"データ田!Q12","v":514},{"$f":"データ田!R12","v":508},{"$f":"データ田!S12","v":492},{"$f":"データ田!T12","v":486},{"$f":"データ田!U12","v":473},{"$f":"データ田!V12","v":466},{"$f":"データ田!W12","v":462},{"$f":"データ田!X12","v":461}]
[null,207,"茅ヶ崎市",{"$f":"データ田!J13","v":51},{"$f":"データ田!K13","v":49},{"$f":"データ田!L13","v":49},{"$f":"データ田!M13","v":47},{"$f":"データ田!N13","v":46},{"$f":"データ田!O13","v":43},{"$f":"データ田!P13","v":43},{"$f":"データ田!Q13","v":43},{"$f":"データ田!R13","v":43},{"$f":"データ田!S13","v":43},{"$f":"データ田!T13","v":43},{"$f":"データ田!U13","v":42},{"$f":"データ田!V13","v":42},{"$f":"データ田!W13","v":42},{"$f":"データ田!X13","v":42}]
{"$rows_left_out":28}
{"sheet":"データ畑","index":24,"n_rows":83,"n_cols":24,"rows_kept":83,"hidden":true}
[{"$nulls":3},16,17,18,19,20,21,22,23,24,25,26,27,28,29,30,1,2,3,4,5,6]
[{"$nulls":3},2004,2005,2006,2007,2008,2009,2010,2011,2012,2013,2014,2015,2016,2017,2018,2019,2020,2021,2022,2023,2024]
[null,null,"神奈川県",{"$nulls":6},{"v":16400,"d":" 16 400"},16300,16200,16000,15800,15700,15700,15500,15400,15100,14800,14600,14500,14400,14300]
[{"$nulls":3},{"$f":"SUM(D5:D83)","v":18508},18464,16785,16699,16594,16461,16352,{"$f":"SUM(K5:K83)","v":16284},16173,16035,15831,15746,15654,15478,15344,15110,14817,14648,14525,14387,33076]
[null,100,"横浜市",{"v":2910,"d":"2,910"},{"v":2910,"d":"2,910"},{"v":2890,"d":"2,890"},{"v":2870,"d":"2,870"},{"v":2830,"d":"2,830"},{"v":2810,"d":"2,810"},{"v":2800,"d":"2,800"},{"v":2790,"d":"2,790"},{"v":2790,"d":"2,790"},{"v":2770,"d":"2,770"},{"v":2710,"d":"2,710"},{"v":2690,"d":"2,690"},{"v":2680,"d":"2,680"},{"v":2660,"d":"2,660"},{"v":2630,"d":"2,630"},{"v":2570,"d":"2,570"},2520,2490,2460,2450,2440]
[null,130,"川崎市",615,614,609,598,593,586,584,581,580,576,551,550,549,549,547,527,507,492,477,465,461]
[null,150,"相模原市",{"$f":"SUM(D41:D45)","v":{"v":1599,"d":"1,599"}},{"$f":"SUM(E41:E45)","v":{"v":1598,"d":"1,598"}},{"v":1590,"d":"1,590"},{"v":1590,"d":"1,590"},{"v":1570,"d":"1,570"},{"v":1550,"d":"1,550"},{"v":1530,"d":"1,530"},{"v":1520,"d":"1,520"},{"v":1510,"d":"1,510"},{"v":1490,"d":"1,490"},{"v":1500,"d":"1,500"},{"v":1490,"d":"1,490"},{"v":1470,"d":"1,470"},{"v":1450,"d":"1,450"},{"v":1430,"d":"1,430"},{"v":1400,"d":"1,400"},1360,1340,1330,1320,1310]
[null,201,"横須賀市",489,516,541,538,537,537,531,530,529,529,527,524,524,523,521,515,507,504,502,501,491]
[null,203,"平塚市",798,788,780,778,775,775,766,766,764,761,752,749,740,738,732,727,718,714,710,705,699]
[null,204,"鎌倉市",121,121,119,117,114,113,109,108,108,106,104,104,103,102,101,99,98,96,95,92,91]
{"$rows_left_out":74}
{"sheet":"グラフ畑","index":25,"n_rows":37,"n_cols":18,"rows_kept":37,"hidden":true}
[{"$nulls":3},{"$f":"データ畑!J2","v":2010},{"$f":"データ畑!K2","v":2011},{"$f":"データ畑!L2","v":2012},{"$f":"データ畑!M2","v":2013},{"$f":"データ畑!N2","v":2014},{"$f":"データ畑!O2","v":2015},{"$f":"データ畑!P2","v":2016},{"$f":"データ畑!Q2","v":2017},{"$f":"データ畑!R2","v":2018},{"$f":"データ畑!S2","v":2019},{"$f":"データ畑!T2","v":2020},{"$f":"データ畑!U2","v":2021},{"$f":"データ畑!V2","v":2022},{"$f":"データ畑!W2","v":2023},{"$f":"データ畑!X2","v":2024}]
[null,100,"横浜市",{"$f":"データ畑!J5","v":2800},{"$f":"データ畑!K5","v":2790},{"$f":"データ畑!L5","v":2790},{"$f":"データ畑!M5","v":2770},{"$f":"データ畑!N5","v":2710},{"$f":"データ畑!O5","v":2690},{"$f":"データ畑!P5","v":2680},{"$f":"データ畑!Q5","v":2660},{"$f":"データ畑!R5","v":2630},{"$f":"データ畑!S5","v":2570},{"$f":"データ畑!T5","v":2520},{"$f":"データ畑!U5","v":2490},{"$f":"データ畑!V5","v":2460},{"$f":"データ畑!W5","v":2450},{"$f":"データ畑!X5","v":2440}]
[null,130,"川崎市",{"$f":"データ畑!J6","v":584},{"$f":"データ畑!K6","v":581},{"$f":"データ畑!L6","v":580},{"$f":"データ畑!M6","v":576},{"$f":"データ畑!N6","v":551},{"$f":"データ畑!O6","v":550},{"$f":"データ畑!P6","v":549},{"$f":"データ畑!Q6","v":549},{"$f":"データ畑!R6","v":547},{"$f":"データ畑!S6","v":527},{"$f":"データ畑!T6","v":507},{"$f":"データ畑!U6","v":492},{"$f":"データ畑!V6","v":477},{"$f":"データ畑!W6","v":465},{"$f":"データ畑!X6","v":461}]
[null,150,"相模原市",{"$f":"データ畑!J7","v":1530},{"$f":"データ畑!K7","v":1520},{"$f":"データ畑!L7","v":1510},{"$f":"データ畑!M7","v":1490},{"$f":"データ畑!N7","v":1500},{"$f":"データ畑!O7","v":1490},{"$f":"データ畑!P7","v":1470},{"$f":"データ畑!Q7","v":1450},{"$f":"データ畑!R7","v":1430},{"$f":"データ畑!S7","v":1400},{"$f":"データ畑!T7","v":1360},{"$f":"データ畑!U7","v":1340},{"$f":"データ畑!V7","v":1330},{"$f":"データ畑!W7","v":1320},{"$f":"データ畑!X7","v":1310}]
[null,201,"横須賀市",{"$f":"データ畑!J8","v":531},{"$f":"データ畑!K8","v":530},{"$f":"データ畑!L8","v":529},{"$f":"データ畑!M8","v":529},{"$f":"データ畑!N8","v":527},{"$f":"データ畑!O8","v":524},{"$f":"データ畑!P8","v":524},{"$f":"データ畑!Q8","v":523},{"$f":"データ畑!R8","v":521},{"$f":"データ畑!S8","v":515},{"$f":"データ畑!T8","v":507},{"$f":"データ畑!U8","v":504},{"$f":"データ畑!V8","v":502},{"$f":"データ畑!W8","v":501},{"$f":"データ畑!X8","v":491}]
[null,203,"平塚市",{"$f":"データ畑!J9","v":766},{"$f":"データ畑!K9","v":766},{"$f":"データ畑!L9","v":764},{"$f":"データ畑!M9","v":761},{"$f":"データ畑!N9","v":752},{"$f":"データ畑!O9","v":749},{"$f":"データ畑!P9","v":740},{"$f":"データ畑!Q9","v":738},{"$f":"データ畑!R9","v":732},{"$f":"データ畑!S9","v":727},{"$f":"データ畑!T9","v":718},{"$f":"データ畑!U9","v":714},{"$f":"データ畑!V9","v":710},{"$f":"データ畑!W9","v":705},{"$f":"データ畑!X9","v":699}]
[null,204,"鎌倉市",{"$f":"データ畑!J10","v":109},{"$f":"データ畑!K10","v":108},{"$f":"データ畑!L10","v":108},{"$f":"データ畑!M10","v":106},{"$f":"データ畑!N10","v":104},{"$f":"データ畑!O10","v":104},{"$f":"データ畑!P10","v":103},{"$f":"データ畑!Q10","v":102},{"$f":"データ畑!R10","v":101},{"$f":"データ畑!S10","v":99},{"$f":"データ畑!T10","v":98},{"$f":"データ畑!U10","v":96},{"$f":"データ畑!V10","v":95},{"$f":"データ畑!W10","v":92},{"$f":"データ畑!X10","v":91}]
[null,205,"藤沢市",{"$f":"データ畑!J11","v":807},{"$f":"データ畑!K11","v":799},{"$f":"データ畑!L11","v":791},{"$f":"データ畑!M11","v":784},{"$f":"データ畑!N11","v":765},{"$f":"データ畑!O11","v":765},{"$f":"データ畑!P11","v":765},{"$f":"データ畑!Q11","v":763},{"$f":"データ畑!R11","v":761},{"$f":"データ畑!S11","v":748},{"$f":"データ畑!T11","v":736},{"$f":"データ畑!U11","v":729},{"$f":"データ畑!V11","v":727},{"$f":"データ畑!W11","v":718},{"$f":"データ畑!X11","v":713}]
[null,206,"小田原市",{"$f":"データ畑!J12","v":1360},{"$f":"データ畑!K12","v":1360},{"$f":"データ畑!L12","v":1340},{"$f":"データ畑!M12","v":1330},{"$f":"データ畑!N12","v":1320},{"$f":"データ畑!O12","v":1320},{"$f":"データ畑!P12","v":1310},{"$f":"データ畑!Q12","v":1310},{"$f":"データ畑!R12","v":1300},{"$f":"データ畑!S12","v":1300},{"$f":"データ畑!T12","v":1290},{"$f":"データ畑!U12","v":1280},{"$f":"データ畑!V12","v":1280},{"$f":"データ畑!W12","v":1270},{"$f":"データ畑!X12","v":1260}]
[null,207,"茅ヶ崎市",{"$f":"データ畑!J13","v":323},{"$f":"データ畑!K13","v":323},{"$f":"データ畑!L13","v":320},{"$f":"データ畑!M13","v":315},{"$f":"データ畑!N13","v":306},{"$f":"データ畑!O13","v":306},{"$f":"データ畑!P13","v":306},{"$f":"データ畑!Q13","v":305},{"$f":"データ畑!R13","v":303},{"$f":"データ畑!S13","v":295},{"$f":"データ畑!T13","v":285},{"$f":"データ畑!U13","v":273},{"$f":"データ畑!V13","v":272},{"$f":"データ畑!W13","v":267},{"$f":"データ畑!X13","v":261}]
{"$rows_left_out":28}
{"sheet":"グラフ","index":26,"n_rows":32,"n_cols":18,"rows_kept":32}
[{"$nulls":3},"↓こちらのタブからご覧になりたい（県）市町村を選択してください。"]
[{"$nulls":3},"神奈川県"]
[null,"(ha）"]
{"$rows_empty":22}
[{"$nulls":17},"(ha)"]
[]
[null,null,"年",{"$f":"'グラフ田 '!D1","v":2010},{"$f":"'グラフ田 '!E1","v":2011},{"$f":"'グラフ田 '!F1","v":2012},{"$f":"'グラフ田 '!G1","v":2013},{"$f":"'グラフ田 '!H1","v":2014},{"$f":"'グラフ田 '!I1","v":2015},{"$f":"'グラフ田 '!J1","v":2016},{"$f":"'グラフ田 '!K1","v":2017},{"$f":"'グラフ田 '!L1","v":2018},{"$f":"'グラフ田 '!M1","v":2019},{"$f":"'グラフ田 '!N1","v":2020},{"$f":"'グラフ田 '!O1","v":2021},{"$f":"'グラフ田 '!P1","v":2022},{"$f":"'グラフ田 '!Q1","v":2023},{"$f":"'グラフ田 '!R1","v":2024}]
[null,{"$f":"D2","v":"神奈川県"},"田",{"$f":"_xlfn.XLOOKUP($D$2,'グラフ田 '!$C2:$C35,'グラフ田 '!D$2:D$35)","v":{"v":4030,"d":"4,030 "}},{"$f":"_xlfn.XLOOKUP($D$2,'グラフ田 '!$C2:$C35,'グラフ田 '!E$2:E$35)","v":{"v":3990,"d":"3,990 "}},{"$f":"_xlfn.XLOOKUP($D$2,'グラフ田 '!$C2:$C35,'グラフ田 '!F$2:F$35)","v":{"v":3970,"d":"3,970 "}},{"$f":"_xlfn.XLOOKUP($D$2,'グラフ田 '!$C2:$C35,'グラフ田 '!G$2:G$35)","v":{"v":3920,"d":"3,920 "}},{"$f":"_xlfn.XLOOKUP($D$2,'グラフ田 '!$C2:$C35,'グラフ田 '!H$2:H$35)","v":{"v":3890,"d":"3,890 "}},{"$f":"_xlfn.XLOOKUP($D$2,'グラフ田 '!$C2:$C35,'グラフ田 '!I$2:I$35)","v":{"v":3850,"d":"3,850 "}},{"$f":"_xlfn.XLOOKUP($D$2,'グラフ田 '!$C2:$C35,'グラフ田 '!J$2:J$35)","v":{"v":3790,"d":"3,790 "}},{"$f":"_xlfn.XLOOKUP($D$2,'グラフ田 '!$C2:$C35,'グラフ田 '!K$2:K$35)","v":{"v":3760,"d":"3,760 "}},{"$f":"_xlfn.XLOOKUP($D$2,'グラフ田 '!$C2:$C35,'グラフ田 '!L$2:L$35)","v":{"v":3730,"d":"3,730 "}},{"$f":"_xlfn.XLOOKUP($D$2,'グラフ田 '!$C2:$C35,'グラフ田 '!M$2:M$35)","v":{"v":3670,"d":"3,670 "}},{"$f":"_xlfn.XLOOKUP($D$2,'グラフ田 '!$C2:$C35,'グラフ田 '!N$2:N$35)","v":{"v":3610,"d":"3,610 "}},{"$f":"_xlfn.XLOOKUP($D$2,'グラフ田 '!$C2:$C35,'グラフ田 '!O$2:O$35)","v":{"v":3530,"d":"3,530 "}},{"$f":"_xlfn.XLOOKUP($D$2,'グラフ田 '!$C2:$C35,'グラフ田 '!P$2:P$35)","v":{"v":3490,"d":"3,490 "}},{"$f":"_xlfn.XLOOKUP($D$2,'グラフ田 '!$C2:$C35,'グラフ田 '!Q$2:Q$35)","v":{"v":3470,"d":"3,470 "}},{"$f":"_xlfn.XLOOKUP($D$2,'グラフ田 '!$C2:$C35,'グラフ田 '!R$2:R$35)","v":{"v":3460,"d":"3,460 "}}]
[null,null,"畑",{"$f":"_xlfn.XLOOKUP($D$2,グラフ畑!$C2:$C35,グラフ畑!D$2:D$35)","v":{"v":16400,"d":"16,400 "}},{"$f":"_xlfn.XLOOKUP($D$2,グラフ畑!$C2:$C35,グラフ畑!E$2:E$35)","v":{"v":16300,"d":"16,300 "}},{"$f":"_xlfn.XLOOKUP($D$2,グラフ畑!$C2:$C35,グラフ畑!F$2:F$35)","v":{"v":16200,"d":"16,200 "}},{"$f":"_xlfn.XLOOKUP($D$2,グラフ畑!$C2:$C35,グラフ畑!G$2:G$35)","v":{"v":16000,"d":"16,000 "}},{"$f":"_xlfn.XLOOKUP($D$2,グラフ畑!$C2:$C35,グラフ畑!H$2:H$35)","v":{"v":15800,"d":"15,800 "}},{"$f":"_xlfn.XLOOKUP($D$2,グラフ畑!$C2:$C35,グラフ畑!I$2:I$35)","v":{"v":15700,"d":"15,700 "}},{"$f":"_xlfn.XLOOKUP($D$2,グラフ畑!$C2:$C35,グラフ畑!J$2:J$35)","v":{"v":15700,"d":"15,700 "}},{"$f":"_xlfn.XLOOKUP($D$2,グラフ畑!$C2:$C35,グラフ畑!K$2:K$35)","v":{"v":15500,"d":"15,500 "}},{"$f":"_xlfn.XLOOKUP($D$2,グラフ畑!$C2:$C35,グラフ畑!L$2:L$35)","v":{"v":15400,"d":"15,400 "}},{"$f":"_xlfn.XLOOKUP($D$2,グラフ畑!$C2:$C35,グラフ畑!M$2:M$35)","v":{"v":15100,"d":"15,100 "}},{"$f":"_xlfn.XLOOKUP($D$2,グラフ畑!$C2:$C35,グラフ畑!N$2:N$35)","v":{"v":14800,"d":"14,800 "}},{"$f":"_xlfn.XLOOKUP($D$2,グラフ畑!$C2:$C35,グラフ畑!O$2:O$35)","v":{"v":14600,"d":"14,600 "}},{"$f":"_xlfn.XLOOKUP($D$2,グラフ畑!$C2:$C35,グラフ畑!P$2:P$35)","v":{"v":14500,"d":"14,500 "}},{"$f":"_xlfn.XLOOKUP($D$2,グラフ畑!$C2:$C35,グラフ畑!Q$2:Q$35)","v":{"v":14400,"d":"14,400 "}},{"$f":"_xlfn.XLOOKUP($D$2,グラフ畑!$C2:$C35,グラフ畑!R$2:R$35)","v":{"v":14300,"d":"14,300 "}}]
[null,null,"調査の概要、利用上の注意",{"$nulls":4},"10年前の2014年から田は、",null,null,{"$f":"H29-R29","v":{"v":430,"d":"430ha"}},"減少","5年前2019年から",null,"田は、",{"$f":"M29-R29","v":{"v":210,"d":"210ha"}},"減少"]
{"$rows_left_out":1}